make[1]: Entering directory `/usr/src/asterisk/apps'
gcc -pipe -Wall -Wstrict-prototypes -Wmissing-prototypes -Wmissing-declarations -g3 -Iinclude -I../include -D_REENTRANT -D_GNU_SOURCE -O6 -march=i686 -fomit-frame-pointer -fPIC -c -o app_rxfax.o app_rxfax.c
app_rxfax.c: In function `phase_e_handler':
app_rxfax.c:110: error: structure has no member named `column_resolution'
app_rxfax.c:110: error: structure has no member named `row_resolution'
app_rxfax.c:121: error: structure has no member named `row_resolution'
app_rxfax.c:127: error: structure has no member named `row_resolution'
app_rxfax.c: In function `phase_d_handler':
app_rxfax.c:152: error: structure has no member named `columns'
app_rxfax.c:152: error: structure has no member named `rows'
app_rxfax.c:153: error: structure has no member named `column_resolution'
app_rxfax.c:153: error: structure has no member named `row_resolution'
app_rxfax.c: In function `rxfax_exec':
app_rxfax.c:286: warning: passing arg 1 of `fax_init' from incompatible pointer type
app_rxfax.c:286: error: too many arguments to function `fax_init'
app_rxfax.c:309: warning: passing arg 1 of `fax_rx' from incompatible pointer type
app_rxfax.c:312: warning: passing arg 1 of `fax_tx' from incompatible pointer type
app_rxfax.c:349: warning: passing arg 1 of `fax_release' from incompatible pointer type
make[1]: *** [app_rxfax.o] Error 1
make[1]: Leaving directory `/usr/src/asterisk/apps'
make: *** [subdirs] Error 1