All pastes #86056 Raw Edit

Stuff

public text v1 · immutable
·published 2006-07-12 14:04 UTC
rendered paste body
q-embed/kdesrc/kssl -I../../konq-embed/kdesrc/kjs  -I/usr/src/universal/dev/build_htcuniversal/staging/arm-linux/include -I/usr/src/universal/dev/build_htcuniversal/staging/arm-linux/qt2/include   -I/usr/src/universal/dev/build_htcuniversal/staging/arm-linux/include  -DQT_THREAD_SUPPORT -DQWS -D_REENTRANT  -Wno-long-long -Wundef -ansi -D_XOPEN_SOURCE=500 -D_BSD_SOURCE -Wcast-align -Wconversion -Wchar-subscripts -Wall -W -Wpointer-arith -g -O2 -fno-reorder-blocks -fno-schedule-insns -fno-inline -fexceptions -frtti -DKJS_VERBOSE=1 -DQT_THREAD_SUPPORT -DQ_OS_UNIX -DQT_NO_DOM -DENABLE_BOOKMARKS -Wformat-security -Wmissing-format-attribute -Wno-non-virtual-dtor -fno-exceptions -fno-check-new -fno-common -DQT_CLEAN_NAMESPACE -DQT_NO_COMPAT -DQT_NO_ASCII_CAST  -MT urlcombo.o -MD -MP -MF ".deps/urlcombo.Tpo" -c -o urlcombo.o urlcombo.cpp; \
|       then mv -f ".deps/urlcombo.Tpo" ".deps/urlcombo.Po"; else rm -f ".deps/urlcombo.Tpo"; exit 1; fi
| urlcombo.cpp:457:7: warning: no newline at end of file
| /bin/sh ../../libtool --silent --tag=CXX --mode=link ccache arm-linux-g++ -march=armv5te -mtune=xscale  -Wno-long-long -Wundef -ansi -D_XOPEN_SOURCE=500 -D_BSD_SOURCE -Wcast-align -Wconversion -Wchar-subscripts -Wall -W -Wpointer-arith -g -O2 -fno-reorder-blocks -fno-schedule-insns -fno-inline -fexceptions -frtti -DKJS_VERBOSE=1 -DQT_THREAD_SUPPORT -DQ_OS_UNIX -DQT_NO_DOM -DENABLE_BOOKMARKS -Wformat-security -Wmissing-format-attribute -Wno-non-virtual-dtor -fno-exceptions -fno-check-new -fno-common -DQT_CLEAN_NAMESPACE -DQT_NO_COMPAT -DQT_NO_ASCII_CAST   -L/usr/src/universal/dev/build_htcuniversal/staging/arm-linux/lib -Wl,-rpath-link,/usr/src/universal/dev/build_htcuniversal/staging/arm-linux/lib -Wl,-O1 -o konqueror  -L/opt/QtPalmtop/lib -L/usr/src/universal/dev/build_htcuniversal/staging/arm-linux/qt2/lib   -L/usr/src/universal/dev/build_htcuniversal/staging/arm-linux/lib -export-dynamic konqueror.all_cc.o urlcombo.o   ../../konq-embed/dropin/kio/libkiodropin.la ../../konq-embed/kdesrc/khtml/ecma/libkjs_html_i.la ../../konq-embed/kdesrc/kjs/libkjs.la -lpcre -lpcreposix ../lib/libkonqe.la ../../konq-embed/kdesrc/kparts/libkparts.la ../../konq-embed/dropin/libdropin.la ../../konq-embed/dropin/kparts/libkpartsdropin.la ../../konq-embed/kdesrc/khtml/libkhtml_i.la ../../konq-embed/dropin/kssl/libkssldropin.la ../../konq-embed/kdesrc/kssl/libkssl.la
| konqueror.all_cc.o(.text+0xc880): In function `MainWindowRoad::setLocationBarURL(QString const&)':
| /usr/src/universal/dev/build_htcuniversal/work/armv5te-linux/konqueror-embedded-20060404-r3/kdenox/konq-embed/src/mainwindow_road.cc:400: undefined reference to `typeinfo for URLCombo'
| konqueror.all_cc.o(.text+0x1d118): In function `MainWindowRoad::initUrlMode(QToolBar*)':
| /usr/src/universal/dev/build_htcuniversal/work/armv5te-linux/konqueror-embedded-20060404-r3/kdenox/konq-embed/src/mainwindow_road.cc:528: undefined reference to `URLCombo::URLCombo(QWidget*, char const*)'
| collect2: ld returned 1 exit status
| make[5]: *** [konqueror] Fejl 1
| make[5]: Forlader katalog '/usr/src/universal/dev/build_htcuniversal/work/armv5te-linux/konqueror-embedded-20060404-r3/kdenox/konq-embed/src'
| make[4]: *** [all-recursive] Fejl 1
| make[4]: Forlader katalog '/usr/src/universal/dev/build_htcuniversal/work/armv5te-linux/konqueror-embedded-20060404-r3/kdenox/konq-embed/src'
| make[3]: *** [all] Fejl 2
| make[3]: Forlader katalog '/usr/src/universal/dev/build_htcuniversal/work/armv5te-linux/konqueror-embedded-20060404-r3/kdenox/konq-embed/src'
| make[2]: *** [all-recursive] Fejl 1
| make[2]: Forlader katalog '/usr/src/universal/dev/build_htcuniversal/work/armv5te-linux/konqueror-embedded-20060404-r3/kdenox/konq-embed'
| make[1]: *** [all-recursive] Fejl 1
| make[1]: Forlader katalog '/usr/src/universal/dev/build_htcuniversal/work/armv5te-linux/konqueror-embedded-20060404-r3/kdenox'
| make: *** [all] Fejl 2
| FATAL: oe_runmake failed
NOTE: Task failed: /usr/src/universal/dev/build_htcuniversal/work/armv5te-linux/konqueror-embedded-20060404-r3/temp/log.do_compile.25782
NOTE: package konqueror-embedded-20060404-r3: task do_compile: failed
ERROR: TaskFailed event exception, aborting
NOTE: package konqueror-embedded-20060404: failed
ERROR: Build of konqueror-embedded failed