All pastes #84615 Raw Edit

Something

public shellscript v1 · immutable
·published 2006-07-11 03:48 UTC
rendered paste body
- ewl ........................ ERROR!-----------------------------------------------------------------------------LAST LOGLINES FROM /tmp/easy_e17/install_logs/ewl.log:-----------------------------------------------------------------------------edje_cc: Wrote      1000 bytes (   1Kb) for "collections/53" collection entryedje_cc: Wrote       727 bytes (   1Kb) for "collections/54" collection entryedje_cc: Wrote       728 bytes (   1Kb) for "collections/55" collection entryedje_cc: Wrote       877 bytes (   1Kb) for "collections/56" collection entryedje_cc: Wrote       888 bytes (   1Kb) for "collections/57" collection entryedje_cc: Wrote      2034 bytes (   2Kb) for "collections/58" collection entryedje_cc: Wrote      2102 bytes (   2Kb) for "collections/59" collection entryedje_cc: Wrote       727 bytes (   1Kb) for "collections/60" collection entryedje_cc: Wrote       919 bytes (   1Kb) for "collections/61" collection entryedje_cc: Wrote       712 bytes (   1Kb) for "collections/62" collection entryedje_cc: Wrote       714 bytes (   1Kb) for "collections/63" collection entryedje_cc: Wrote       939 bytes (   1Kb) for "collections/64" collection entryedje_cc: Wrote      1099 bytes (   1Kb) for "collections/65" collection entryedje_cc: Wrote      1198 bytes (   1Kb) for "collections/66" collection entryedje_cc: Wrote       837 bytes (   1Kb) for "collections/67" collection entryedje_cc: Wrote       697 bytes (   1Kb) for "collections/68" collection entryedje_cc: Wrote       778 bytes (   1Kb) for "collections/69" collection entryedje_cc: Wrote       781 bytes (   1Kb) for "collections/70" collection entrymake[3]: *** [e17.edj] Error 255make[3]: Leaving directory `/root/e17_cvs/e17/libs/ewl/data/themes'make[2]: *** [all-recursive] Error 1make[2]: Leaving directory `/root/e17_cvs/e17/libs/ewl/data'make[1]: *** [all-recursive] Error 1make[1]: Leaving directory `/root/e17_cvs/e17/libs/ewl'make: *** [all] Error 2