XmStrDefs.c:1371: warning: excess elements in scalar initializer
XmStrDefs.c:1371: warning: (near initialization for '_XmStrings')
XmStrDefs.c:1371: warning: excess elements in scalar initializer
XmStrDefs.c:1371: warning: (near initialization for '_XmStrings')
XmStrDefs.c:1371: warning: excess elements in scalar initializer
XmStrDefs.c:1371: warning: (near initialization for '_XmStrings')
XmStrDefs.c:1371: warning: excess elements in scalar initializer
XmStrDefs.c:1371: warning: (near initialization for '_XmStrings')
XmStrDefs.c:1371: warning: excess elements in scalar initializer
XmStrDefs.c:1371: warning: (near initialization for '_XmStrings')
XmStrDefs.c:1371: warning: excess elements in scalar initializer
XmStrDefs.c:1371: warning: (near initialization for '_XmStrings')
XmStrDefs.c:1371: warning: excess elements in scalar initializer
XmStrDefs.c:1371: warning: (near initialization for '_XmStrings')
XmStrDefs.c:1371: warning: excess elements in scalar initializer
XmStrDefs.c:1371: warning: (near initialization for '_XmStrings')
XmStrDefs.c:1371: warning: excess elements in scalar initializer
XmStrDefs.c:1371: warning: (near initialization for '_XmStrings')
XmStrDefs.c:1371: warning: excess elements in scalar initializer
XmStrDefs.c:1371: warning: (near initialization for '_XmStrings')
XmStrDefs.c:1371: warning: excess elements in scalar initializer
XmStrDefs.c:1371: warning: (near initialization for '_XmStrings')
XmStrDefs.c:1371: warning: excess elements in scalar initializer
XmStrDefs.c:1371: warning: (near initialization for '_XmStrings')
XmStrDefs.c:1371: warning: excess elements in scalar initializer
XmStrDefs.c:1371: warning: (near initialization for '_XmStrings')
XmStrDefs.c:1371: warning: excess elements in scalar initializer
XmStrDefs.c:1371: warning: (near initialization for '_XmStrings')
XmStrDefs.c:1371: warning: excess elements in scalar initializer
XmStrDefs.c:1371: warning: (near initialization for '_XmStrings')
XmStrDefs.c:1371: warning: excess elements in scalar initializer
XmStrDefs.c:1371: warning: (near initialization for '_XmStrings')
XmStrDefs.c:1371: warning: excess elements in scalar initializer
XmStrDefs.c:1371: warning: (near initialization for '_XmStrings')
XmStrDefs.c:1372: warning: excess elements in scalar initializer
XmStrDefs.c:1372: warning: (near initialization for '_XmStrings')
XmStrDefs.c:1374: error: expected declaration specifiers before 'externaldef'
XmStrDefs.c:1666: error: expected declaration specifiers before ';' token
XmStrDefs.c:1668: error: expected declaration specifiers before 'externaldef'
XmStrDefs.c:1713: error: expected declaration specifiers before ';' token
XmStrDefs.c:18: error: declaration for parameter '_XmStrings' but no such parameter
XmStrDefs.c:1713: error: expected '{' at end of input
make[3]: *** [XmStrDefs.lo] Error 1
make[3]: Leaving directory `/var/tmp/portage/openmotif-2.2.3-r9/work/openMotif-2.2.3/lib/Xm'
make[2]: *** [all] Error 2
make[2]: Leaving directory `/var/tmp/portage/openmotif-2.2.3-r9/work/openMotif-2.2.3/lib/Xm'
make[1]: *** [all-recursive] Error 1
make[1]: Leaving directory `/var/tmp/portage/openmotif-2.2.3-r9/work/openMotif-2.2.3/lib'
make: *** [all-recursive] Error 1
!!! ERROR: x11-libs/openmotif-2.2.3-r9 failed.
Call stack:
ebuild.sh, line 1545: Called dyn_compile
ebuild.sh, line 940: Called src_compile
openmotif-2.2.3-r9.ebuild, line 84: Called die
!!! make failed, if you have lesstif installed removed it, compile openmotif and recompile lesstif
!!! If you need support, post the topmost build error, and the call stack if relevant