$ make
cd mytharchive && qmake mytharchive.pro -o Makefile
cd mytharchive && make -f Makefile
make[1]: Entering directory `/home/phil/src/mythplugins/mytharchive'
cd mytharchive && qmake mytharchive.pro -o Makefile
cd mytharchive && make -f Makefile
make[2]: Entering directory `/home/phil/src/mythplugins/mytharchive/mytharchive'
ccache g++ -c -pipe -march=k8 -I/usr/include/kde/artsc -pthread -I/usr/include/glib-2.0 -I/usr/lib/glib-2.0/include -Wall -W -O3 -fPIC -DPIC -Wall -Wno-switch -fomit-frame-pointer -g -DNDEBUG -D_REENTRANT -DPIC -fPIC -D_GNU_SOURCE -DPREFIX=\"/usr\" -DMMX -DUSING_FREEBOX -D_FILE_OFFSET_BITS=64 -DQT_NO_DEBUG -DQT_THREAD_SUPPORT -DQT_PLUGIN -DQT_SHARED -DQT_TABLET_SUPPORT -I/usr/share/qt3/mkspecs/default -I. -I/usr/include -I/usr/include -I/usr/include -I/usr/include/mythtv -I/usr/include/mythtv/ffmpeg -I/usr/include/mythtv/libmythtv -I/usr/include/qt3 -o main.o main.cpp
main.cpp:27:34: error: mythtv/mythpluginapi.h: No such file or directory
main.cpp: In function âvoid runCreateDVD()â:
main.cpp:133: error: âDialogCodeâ was not declared in this scope
main.cpp:133: error: expected `;' before âresâ
main.cpp:138: error: âkDialogCodeRejectedâ was not declared in this scope
main.cpp:138: error: âresâ was not declared in this scope
main.cpp: In function âvoid runCreateArchive()â:
main.cpp:180: error: âDialogCodeâ was not declared in this scope
main.cpp:180: error: expected `;' before âresâ
main.cpp:185: error: âkDialogCodeRejectedâ was not declared in this scope
main.cpp:185: error: âresâ was not declared in this scope
main.cpp: In function âvoid runImportVideo()â:
main.cpp:230: error: âDialogCodeâ was not declared in this scope
main.cpp:230: error: expected `;' before âresâ
main.cpp:233: error: âkDialogCodeRejectedâ was not declared in this scope
main.cpp:233: error: âresâ was not declared in this scope
main.cpp: In function âvoid runBurnDVD()â:
main.cpp:319: error: âDialogCodeâ was not declared in this scope
main.cpp:319: error: expected `;' before âresâ
main.cpp:323: error: âkDialogCodeButton3â was not declared in this scope
main.cpp:323: error: âresâ was not declared in this scope
main.cpp:323: error: âkDialogCodeRejectedâ was not declared in this scope
main.cpp:326: error: âCalcItemIndexâ is not a member of âMythDialogâ
main.cpp:326: error: âresâ was not declared in this scope
main.cpp:348: error: âkDialogCodeButton2â was not declared in this scope
make[2]: *** [main.o] Error 1
make[2]: Leaving directory `/home/phil/src/mythplugins/mytharchive/mytharchive'
make[1]: *** [sub-mytharchive] Error 2
make[1]: Leaving directory `/home/phil/src/mythplugins/mytharchive'
make: *** [sub-mytharchive] Error 2