All pastes #839970 Raw Edit

Stuff

public text v1 · immutable
#839970 ·published 2007-12-31 11:18 UTC
rendered paste body
pgsqlDB.cc:32:22: error: libpq-fe.h: No such file or directory
pgsqlDB.h:40: error: ISO C++ forbids declaration of 'PGconn' with no type
pgsqlDB.h:40: error: expected ';' before '*' token
pgsqlDB.h:41: error: ISO C++ forbids declaration of 'PGresult' with no type
pgsqlDB.h:41: error: expected ';' before '*' token
pgsqlDB.cc: In constructor 'gnuworld::pgsqlDB::pgsqlDB(const std::string&, short unsigned int, const std::string&, const std::string&, const std::string&)':
pgsqlDB.cc:54: error: class 'gnuworld::pgsqlDB' does not have any field named 'theDB'
pgsqlDB.cc:55: error: class 'gnuworld::pgsqlDB' does not have any field named 'lastResult'
pgsqlDB.cc:73: error: 'theDB' was not declared in this scope
pgsqlDB.cc:73: error: 'PQconnectdb' was not declared in this scope
pgsqlDB.cc: In constructor 'gnuworld::pgsqlDB::pgsqlDB(const std::string&)':
pgsqlDB.cc:93: error: 'theDB' was not declared in this scope
pgsqlDB.cc:93: error: 'PQconnectdb' was not declared in this scope
pgsqlDB.cc: In destructor 'virtual gnuworld::pgsqlDB::~pgsqlDB()':
pgsqlDB.cc:111: error: 'theDB' was not declared in this scope
pgsqlDB.cc:113: error: 'PQfinish' was not declared in this scope
pgsqlDB.cc:116: error: 'lastResult' was not declared in this scope
pgsqlDB.cc:118: error: 'PQclear' was not declared in this scope
pgsqlDB.cc: In member function 'virtual bool gnuworld::pgsqlDB::Exec(const std::string&, bool)':
pgsqlDB.cc:127: error: 'lastResult' was not declared in this scope
pgsqlDB.cc:129: error: 'PQclear' was not declared in this scope
pgsqlDB.cc:132: error: 'lastResult' was not declared in this scope
pgsqlDB.cc:132: error: 'theDB' was not declared in this scope
pgsqlDB.cc:132: error: 'PQexec' was not declared in this scope
pgsqlDB.cc:134: error: 'ExecStatusType' was not declared in this scope
pgsqlDB.cc:134: error: expected `;' before 'status'
pgsqlDB.cc:139: error: 'PGRES_TUPLES_OK' was not declared in this scope
pgsqlDB.cc:139: error: 'status' was not declared in this scope
pgsqlDB.cc:144: error: 'PGRES_COMMAND_OK' was not declared in this scope
pgsqlDB.cc:144: error: 'status' was not declared in this scope
pgsqlDB.cc: In member function 'virtual bool gnuworld::pgsqlDB::StopCopyIn()':
pgsqlDB.cc:160: error: 'lastResult' was not declared in this scope
pgsqlDB.cc:164: error: 'theDB' was not declared in this scope
pgsqlDB.cc:164: error: 'PQputCopyEnd' was not declared in this scope
pgsqlDB.cc: In member function 'virtual bool gnuworld::pgsqlDB::PutLine(const std::string&)':
pgsqlDB.cc:169: error: 'lastResult' was not declared in this scope
pgsqlDB.cc:173: error: 'theDB' was not declared in this scope
pgsqlDB.cc:173: error: 'PQputline' was not declared in this scope
pgsqlDB.cc: In member function 'virtual unsigned int gnuworld::pgsqlDB::countTuples() const':
pgsqlDB.cc:178: error: 'lastResult' was not declared in this scope
pgsqlDB.cc:182: error: 'lastResult' was not declared in this scope
pgsqlDB.cc:182: error: 'PQntuples' was not declared in this scope
pgsqlDB.cc: In member function 'virtual const std::string gnuworld::pgsqlDB::ErrorMessage() const':
pgsqlDB.cc:187: error: 'theDB' was not declared in this scope
pgsqlDB.cc:187: error: 'PQerrorMessage' was not declared in this scope
pgsqlDB.cc: In member function 'virtual const std::string gnuworld::pgsqlDB::GetValue(unsigned int, unsigned int) const':
pgsqlDB.cc:193: error: 'lastResult' was not declared in this scope
pgsqlDB.cc:197: error: 'lastResult' was not declared in this scope
pgsqlDB.cc:197: error: 'PQgetvalue' was not declared in this scope
pgsqlDB.cc: In member function 'virtual const std::string gnuworld::pgsqlDB::GetValue(unsigned int, const std::string&) const':
pgsqlDB.cc:203: error: 'lastResult' was not declared in this scope
pgsqlDB.cc:209: error: 'lastResult' was not declared in this scope
pgsqlDB.cc:209: error: 'PQfnumber' was not declared in this scope
pgsqlDB.cc:215: error: 'PQgetvalue' was not declared in this scope
pgsqlDB.cc: In member function 'virtual bool gnuworld::pgsqlDB::isConnected() const':
pgsqlDB.cc:220: error: 'CONNECTION_OK' was not declared in this scope
pgsqlDB.cc:220: error: 'theDB' was not declared in this scope
pgsqlDB.cc:220: error: 'PQstatus' was not declared in this scope
make[1]: *** [pgsqlDB.lo] Error 1
make[1]: Leaving directory `/home/gnuworld/gnuworld/db'
make: *** [all-recursive] Error 1