All pastes #839355 Raw Edit

Unnamed

public text v1 · immutable
#839355 ·published 2007-12-30 23:59 UTC
rendered paste body
                 [copy] Copying 1 file to '/home/ckrinke/svnsugi/opensim/OpenSim/Region/ScriptEngine/DotNetEngine/../../../../bin/ScriptEngines/'.

            BUILD SUCCEEDED - 0 non-fatal error(s), 5 warning(s)

            Total time: 1.7 seconds.

     [nant] /home/ckrinke/svnsugi/opensim/OpenSim/Region/ScriptEngine/RemoteServer/OpenSim.Region.ScriptEngine.RemoteServer.dll.build build
            Buildfile: file:///home/ckrinke/svnsugi/opensim/OpenSim/Region/ScriptEngine/RemoteServer/OpenSim.Region.ScriptEngine.RemoteServer.dll.build
            Target framework: Mono 2.0 Profile
            Target(s) specified: build


            build:

                 [echo] Build Directory is /home/ckrinke/svnsugi/opensim/OpenSim/Region/ScriptEngine/RemoteServer/bin/Debug
                [mkdir] Creating directory '/home/ckrinke/svnsugi/opensim/OpenSim/Region/ScriptEngine/RemoteServer/bin/Debug'.
                  [csc] Compiling 5 files to '/home/ckrinke/svnsugi/opensim/OpenSim/Region/ScriptEngine/RemoteServer/bin/Debug/OpenSim.Region.ScriptEngine.RemoteServer.dll'.
                  [csc] /home/ckrinke/svnsugi/opensim/OpenSim/Region/ScriptEngine/RemoteServer/EventManager.cs(32,15): error CS0234: The type or namespace name `Grid' does not exist in the namespace `OpenSim'. Are you missing an assembly reference?
                  [csc] /home/ckrinke/svnsugi/opensim/OpenSim/Region/ScriptEngine/RemoteServer/EventManager.cs(32,1): error CS0246: The type or namespace name `Grid.ScriptServer' could not be found. Are you missing a using directive or an assembly reference?
                  [csc] /home/ckrinke/svnsugi/opensim/OpenSim/Region/ScriptEngine/RemoteServer/EventManager.cs(33,35): error CS0234: The type or namespace name `DotNetEngine' does not exist in the namespace `OpenSim.Region.ScriptEngine'. Are you missing an assembly reference?
                  [csc] /home/ckrinke/svnsugi/opensim/OpenSim/Region/ScriptEngine/RemoteServer/EventManager.cs(33,1): error CS0246: The type or namespace name `ScriptEngine.DotNetEngine' could not be found. Are you missing a using directive or an assembly reference?
                  [csc] /home/ckrinke/svnsugi/opensim/OpenSim/Region/ScriptEngine/RemoteServer/EventManager.cs(44,36): error CS0234: The type or namespace name `Dictionary`2' does not exist in the namespace `System.Collections.Generic'. Are you missing an assembly reference?
                  [csc] /home/ckrinke/svnsugi/opensim/OpenSim/Region/ScriptEngine/RemoteServer/RemoteServer.cs(15,24): error CS0234: The type or namespace name `Grid' does not exist in the namespace `OpenSim'. Are you missing an assembly reference?
                  [csc] /home/ckrinke/svnsugi/opensim/OpenSim/Region/ScriptEngine/RemoteServer/EventManager.cs(32,15): error CS0234: The type or namespace name `Grid' does not exist in the namespace `OpenSim'. Are you missing an assembly reference?
                  [csc] /home/ckrinke/svnsugi/opensim/OpenSim/Region/ScriptEngine/RemoteServer/EventManager.cs(32,1): error CS0246: The type or namespace name `Grid.ScriptServer' could not be found. Are you missing a using directive or an assembly reference?
                  [csc] /home/ckrinke/svnsugi/opensim/OpenSim/Region/ScriptEngine/RemoteServer/EventManager.cs(33,35): error CS0234: The type or namespace name `DotNetEngine' does not exist in the namespace `OpenSim.Region.ScriptEngine'. Are you missing an assembly reference?
                  [csc] /home/ckrinke/svnsugi/opensim/OpenSim/Region/ScriptEngine/RemoteServer/EventManager.cs(33,1): error CS0246: The type or namespace name `ScriptEngine.DotNetEngine' could not be found. Are you missing a using directive or an assembly reference?
                  [csc] Compilation failed: 10 error(s), 0 warnings

            BUILD FAILED - 0 non-fatal error(s), 10 warning(s)

            /home/ckrinke/svnsugi/opensim/OpenSim/Region/ScriptEngine/RemoteServer/OpenSim.Region.ScriptEngine.RemoteServer.dll.build(10,10):
            External Program Failed: /home/ckrinke/mono-1.2.4/lib/pkgconfig/../../lib/mono/2.0/gmcs.exe (return code was 1)

            Total time: 0.7 seconds.


BUILD FAILED

Nested build failed.  Refer to build log for exact reason.

Total time: 49.6 seconds.

[ckrinke@hwa opensim]$