root@powerslave:/usr/ports/x11/kde3# make
===> kde-3.5.3 depends on file: /usr/X11R6/bin/moc - found
===> kde-3.5.3 depends on shared library: kfontinst - not found
===> Verifying install for kfontinst in /usr/ports/x11/kdebase3
===> Building for kdebase-3.5.3_4
gmake all-recursive
gmake[1]: Entering directory `/usr/ports/x11/kdebase3/work/kdebase-3.5.3'
Making all in libkonq
gmake[2]: Entering directory `/usr/ports/x11/kdebase3/work/kdebase-3.5.3/libkonq'
Making all in pics
gmake[3]: Entering directory `/usr/ports/x11/kdebase3/work/kdebase-3.5.3/libkonq/pics'
gmake[3]: Nothing to be done for `all'.
gmake[3]: Leaving directory `/usr/ports/x11/kdebase3/work/kdebase-3.5.3/libkonq/pics'
Making all in favicons
gmake[3]: Entering directory `/usr/ports/x11/kdebase3/work/kdebase-3.5.3/libkonq/favicons'
if /bin/sh /usr/local/bin/libtool --silent --tag=CXX --mode=compile c++ -DHAVE_CONFIG_H -I. -I. -I../.. -I/usr/local/include -I/usr/X11R6/include -I/usr/local/include -D_THREAD_SAFE -pthread -DQT_THREAD_SUPPORT -I/usr/local/include -I/usr/local/include -I/usr/X11R6/include -D_GETOPT_H -D_THREAD_SAFE -Wno-long-long -Wundef -Wall -W -Wpointer-arith -DNDEBUG -DNO_DEBUG -O2 -O -pipe -Wno-non-virtual-dtor -fno-exceptions -fno-check-new -fno-common -DQT_CLEAN_NAMESPACE -DQT_NO_ASCII_CAST -DQT_NO_STL -DQT_NO_COMPAT -DQT_NO_TRANSLATION -D_GNU_SOURCE -MT favicons.lo -MD -MP -MF ".deps/favicons.Tpo" -c -o favicons.lo favicons.cpp; \
then mv -f ".deps/favicons.Tpo" ".deps/favicons.Plo"; else rm -f ".deps/favicons.Tpo"; exit 1; fi
favicons.cpp:29:77: kdatastream.h: No such file or directory
favicons.cpp:30:24: kicontheme.h: No such file or directory
favicons.cpp:31:22: kimageio.h: No such file or directory
favicons.cpp:32:27: ksimpleconfig.h: No such file or directory
favicons.cpp:33:27: kstandarddirs.h: No such file or directory
favicons.cpp:34:21: kio/job.h: No such file or directory
In file included from favicons.moc:11,
from favicons.cpp:36:
favicons.h:22:24: kdedmodule.h: No such file or directory
favicons.h:23:18: kurl.h: No such file or directory
In file included from favicons.moc:11,
from favicons.cpp:36:
favicons.h:46: error: expected class-name before '{' token
favicons.h:49: error: ISO C++ forbids declaration of `K_DCOP' with no type
favicons.h:49: error: expected `;' before "public"
favicons.h:63: error: expected primary-expression before "iconForURL"
favicons.h:63: error: ISO C++ forbids declaration of `k_dcop' with no type
favicons.h:63: error: expected `;' before "iconForURL"
favicons.h:73: error: `ASYNC' does not name a type
favicons.h:81: error: `ASYNC' does not name a type
favicons.h:84: error: expected primary-expression before "void"
favicons.h:84: error: ISO C++ forbids declaration of `k_dcop_signals' with no type
favicons.h:84: error: expected `;' before "void"
favicons.h:85: error: variable or field `infoMessage' declared void
favicons.h:85: error: expected `;' before '(' token
favicons.h:88: error: expected `,' or `...' before '&' token
favicons.h:88: error: ISO C++ forbids declaration of `KURL' with no type
favicons.h:89: error: expected `,' or `...' before '&' token
favicons.h:89: error: ISO C++ forbids declaration of `KURL' with no type
favicons.h:90: error: expected `,' or `...' before '&' token
favicons.h:90: error: ISO C++ forbids declaration of `KURL' with no type
In file included from favicons.cpp:36:
favicons.moc: In static member function `static QMetaObject* FaviconsModule::staticMetaObject()':
favicons.moc:54: error: `KDEDModule' has not been declared
favicons.moc: In member function `virtual void* FaviconsModule::qt_cast(const char*)':
favicons.moc:93: error: `KDEDModule' has not been declared
favicons.moc: In member function `virtual bool FaviconsModule::qt_invoke(int, QUObject*)':
favicons.moc:104: error: `KDEDModule' has not been declared
favicons.moc: In member function `virtual bool FaviconsModule::qt_emit(int, QUObject*)':
favicons.moc:111: error: `KDEDModule' has not been declared
favicons.moc: In member function `virtual bool FaviconsModule::qt_property(int, int, QVariant*)':
favicons.moc:117: error: `KDEDModule' has not been declared
favicons.cpp: At global scope:
favicons.cpp:50: error: ISO C++ forbids declaration of `KSimpleConfig' with no type
favicons.cpp:50: error: expected `;' before '*' token
favicons.cpp:52: error: using-declaration for non-member at class scope
favicons.cpp:52: error: expected `;' before "metaData"
favicons.cpp: In destructor `virtual FaviconsModulePrivate::~FaviconsModulePrivate()':
favicons.cpp:40: error: `config' undeclared (first use this function)
favicons.cpp:40: error: (Each undeclared identifier is reported only once for each function it appears in.)
favicons.cpp: At global scope:
favicons.cpp:58: error: prototype for `FaviconsModule::FaviconsModule(const QCString&)' does not match any in class `FaviconsModule'
favicons.h:46: error: candidates are: FaviconsModule::FaviconsModule()
favicons.h:46: error: FaviconsModule::FaviconsModule(const FaviconsModule&)
favicons.cpp: In constructor `FaviconsModule::FaviconsModule(const QCString&)':
favicons.cpp:58: error: class `FaviconsModule' does not have any field named `KDEDModule'
favicons.cpp:62: error: `KGlobal' has not been declared
favicons.cpp:62: error: `dirs' undeclared (first use this function)
favicons.cpp:64: error: 'struct FaviconsModulePrivate' has no member named 'metaData'
favicons.cpp:65: error: 'struct FaviconsModulePrivate' has no member named 'metaData'
favicons.cpp:66: error: 'struct FaviconsModulePrivate' has no member named 'metaData'
favicons.cpp:67: error: 'struct FaviconsModulePrivate' has no member named 'metaData'
favicons.cpp:68: error: 'struct FaviconsModulePrivate' has no member named 'metaData'
favicons.cpp:69: error: 'struct FaviconsModulePrivate' has no member named 'config'
favicons.cpp:69: error: `KSimpleConfig' has not been declared
favicons.cpp:69: error: `locateLocal' undeclared (first use this function)
favicons.cpp: At global scope:
favicons.cpp:92: error: expected `,' or `...' before '&' token
favicons.cpp:93: error: ISO C++ forbids declaration of `KURL' with no type
favicons.cpp:93: error: no `QString FaviconsModule::iconForURL(int)' member function declared in class `FaviconsModule'
favicons.cpp: In member function `QString FaviconsModule::iconForURL(int)':
favicons.cpp:94: error: `url' undeclared (first use this function)
favicons.cpp:104: error: 'struct FaviconsModulePrivate' has no member named 'config'
favicons.cpp:107: error: `KURL' cannot be used as a function
favicons.cpp: At global scope:
favicons.cpp:119: error: expected `,' or `...' before '&' token
favicons.cpp:120: error: ISO C++ forbids declaration of `KURL' with no type
favicons.cpp: In member function `QString FaviconsModule::simplifyURL(int)':
favicons.cpp:122: error: `url' undeclared (first use this function)
favicons.cpp: At global scope:
favicons.cpp:120: warning: unused parameter 'KURL'
favicons.cpp:129: error: expected `,' or `...' before '&' token
favicons.cpp:130: error: ISO C++ forbids declaration of `KURL' with no type
favicons.cpp: In member function `QString FaviconsModule::iconNameFromURL(int)':
favicons.cpp:131: error: `iconURL' undeclared (first use this function)
favicons.cpp: At global scope:
favicons.cpp:130: warning: unused parameter 'KURL'
favicons.cpp: In member function `bool FaviconsModule::isIconOld(const QString&)':
favicons.cpp:149: error: aggregate `stat st' has incomplete type and cannot be defined
favicons.cpp:150: error: invalid use of undefined type `struct stat'
favicons.cpp:149: error: forward declaration of `struct stat'
favicons.cpp: At global scope:
favicons.cpp:156: error: expected `,' or `...' before '&' token
favicons.cpp:157: error: ISO C++ forbids declaration of `KURL' with no type
favicons.cpp:157: error: no `void FaviconsModule::setIconForURL(int)' member function declared in class `FaviconsModule'
favicons.cpp: In member function `void FaviconsModule::setIconForURL(int)':
favicons.cpp:158: error: `url' undeclared (first use this function)
favicons.cpp:160: error: `iconURL' undeclared (first use this function)
favicons.cpp:166: error: `iconChanged' undeclared (first use this function)
favicons.cpp: At global scope:
favicons.cpp:157: warning: unused parameter 'KURL'
favicons.cpp:173: error: expected `,' or `...' before '&' token
favicons.cpp:174: error: ISO C++ forbids declaration of `KURL' with no type
favicons.cpp:174: error: no `void FaviconsModule::downloadHostIcon(int)' member function declared in class `FaviconsModule'
favicons.cpp: In member function `void FaviconsModule::downloadHostIcon(int)':
favicons.cpp:175: error: `url' undeclared (first use this function)
favicons.cpp:179: error: `KURL' cannot be used as a function
favicons.cpp: At global scope:
favicons.cpp:182: error: expected `,' or `...' before '&' token
favicons.cpp:183: error: ISO C++ forbids declaration of `KURL' with no type
favicons.cpp: In member function `void FaviconsModule::startDownload(const QString&, bool, int)':
favicons.cpp:184: error: `iconURL' undeclared (first use this function)
favicons.cpp:187: error: `get' is not a member of `KIO'
favicons.cpp:188: error: invalid use of undefined type `struct KIO::Job'
favicons.h:25: error: forward declaration of `struct KIO::Job'
favicons.cpp:188: error: 'struct FaviconsModulePrivate' has no member named 'metaData'
favicons.cpp:189: error: `connect' undeclared (first use this function)
favicons.cpp: At global scope:
favicons.cpp:183: warning: unused parameter 'KURL'
favicons.cpp: In member function `void FaviconsModule::slotData(KIO::Job*, const QByteArray&)':
favicons.cpp:205: error: no matching function for call to `QTimer::singleShot(int, FaviconsModule* const, const char[12])'
/usr/X11R6/include/qtimer.h:59: note: candidates are: static void QTimer::singleShot(int, QObject*, const char*)
favicons.cpp: In member function `void FaviconsModule::slotResult(KIO::Job*)':
favicons.cpp:215: error: `KURL' undeclared (first use this function)
favicons.cpp:215: error: expected `;' before "iconURL"
favicons.cpp:217: error: invalid use of undefined type `struct KIO::Job'
favicons.h:25: error: forward declaration of `struct KIO::Job'
favicons.cpp:232: error: `KIcon' has not been declared
favicons.cpp:232: error: `SizeSmall' undeclared (first use this function)
favicons.cpp:232: error: `KIcon' has not been declared
favicons.cpp:233: error: `KIcon' has not been declared
favicons.cpp:233: error: `KIcon' has not been declared
favicons.cpp:238: error: `iconURL' undeclared (first use this function)
favicons.cpp:248: error: 'struct FaviconsModulePrivate' has no member named 'config'
favicons.cpp:254: error: `iconChanged' undeclared (first use this function)
favicons.cpp: At global scope:
favicons.cpp:258: error: no `void FaviconsModule::slotInfoMessage(KIO::Job*, const QString&)' member function declared in class `FaviconsModule'
favicons.cpp:258: error: `void FaviconsModule::slotInfoMessage(KIO::Job*, const QString&)' and `void FaviconsModule::slotInfoMessage(KIO::Job*, const QString&)' cannot be overloaded
favicons.cpp: In member function `void FaviconsModule::slotInfoMessage(KIO::Job*, const QString&)':
favicons.cpp:259: error: `KIO::TransferJob' has not been declared
favicons.cpp:259: error: expected `>' before '*' token
favicons.cpp:259: error: expected `(' before '*' token
favicons.cpp:259: error: expected primary-expression before '>' token
favicons.cpp:259: error: invalid use of undefined type `struct KIO::Job'
favicons.h:25: error: forward declaration of `struct KIO::Job'
favicons.cpp: At global scope:
favicons.cpp:263: error: no `void FaviconsModule::slotKill()' member function declared in class `FaviconsModule'
favicons.cpp:263: error: `void FaviconsModule::slotKill()' and `void FaviconsModule::slotKill()' cannot be overloaded
favicons.cpp:268: error: `KDE_EXPORT' does not name a type
gmake[3]: *** [favicons.lo] Error 1
gmake[3]: Leaving directory `/usr/ports/x11/kdebase3/work/kdebase-3.5.3/libkonq/favicons'
gmake[2]: *** [all-recursive] Error 1
gmake[2]: Leaving directory `/usr/ports/x11/kdebase3/work/kdebase-3.5.3/libkonq'
gmake[1]: *** [all-recursive] Error 1
gmake[1]: Leaving directory `/usr/ports/x11/kdebase3/work/kdebase-3.5.3'
gmake: *** [all] Error 2
*** Error code 2
Stop in /usr/ports/x11/kdebase3.
*** Error code 1
Stop in /usr/ports/x11/kde3.
root@powerslave:/usr/ports/x11/kde3#