All pastes #839010 Raw Edit

Untitled

public cpp v1 · immutable
#839010 ·published 2007-12-30 20:18 UTC
rendered paste body
This file contains any messages produced by compilers whilerunning configure, to aid debugging if configure makes a mistake.It was created by configure, which wasgenerated by GNU Autoconf 2.61.  Invocation command line was  $ ./configure ## --------- #### Platform. #### --------- ##hostname = server.infinite-studio.comuname -m = x86_64uname -r = 2.6.18-5-amd64uname -s = Linuxuname -v = #1 SMP Sat Dec 22 20:43:59 UTC 2007/usr/bin/uname -p = unknown/bin/uname -X     = unknown/bin/arch              = x86_64/usr/bin/arch -k       = unknown/usr/convex/getsysinfo = unknown/usr/bin/hostinfo      = unknown/bin/machine           = unknown/usr/bin/oslevel       = unknown/bin/universe          = unknownPATH: /home/twilight/binPATH: /usr/local/binPATH: /usr/binPATH: /binPATH: /usr/games## ----------- #### Core tests. #### ----------- ##configure:1873: checking whether make sets $(MAKE)configure:1894: result: yesconfigure:1951: checking for gccconfigure:1967: found /home/twilight/bin/gccconfigure:1978: result: gccconfigure:2216: checking for C compiler versionconfigure:2223: gcc --version >&5gcc (GCC) 3.4.6 (Debian 3.4.6-5)Copyright (C) 2006 Free Software Foundation, Inc.This is free software; see the source for copying conditions.  There is NOwarranty; not even for MERCHANTABILITY or FITNESS FOR A PARTICULAR PURPOSE.configure:2226: $? = 0configure:2233: gcc -v >&5Reading specs from /usr/lib/gcc/x86_64-linux-gnu/3.4.6/specsConfigured with: ../src/configure -v --enable-languages=c,c++,f77,pascal --prefix=/usr --libexecdir=/usr/lib --with-gxx-include-dir=/usr/include/c++/3.4 --enable-shared --with-system-zlib --enable-nls --without-included-gettext --program-suffix=-3.4 --enable-__cxa_atexit --enable-clocale=gnu --enable-libstdcxx-debug x86_64-linux-gnuThread model: posixgcc version 3.4.6 (Debian 3.4.6-5)configure:2236: $? = 0configure:2243: gcc -V >&5gcc: `-V' option must have argumentconfigure:2246: $? = 1configure:2269: checking for C compiler default output file nameconfigure:2296: gcc    conftest.c  >&5configure:2299: $? = 0configure:2337: result: a.outconfigure:2354: checking whether the C compiler worksconfigure:2364: ./a.outconfigure:2367: $? = 0configure:2384: result: yesconfigure:2391: checking whether we are cross compilingconfigure:2393: result: noconfigure:2396: checking for suffix of executablesconfigure:2403: gcc -o conftest    conftest.c  >&5configure:2406: $? = 0configure:2430: result: configure:2436: checking for suffix of object filesconfigure:2462: gcc -c   conftest.c >&5configure:2465: $? = 0configure:2488: result: oconfigure:2492: checking whether we are using the GNU C compilerconfigure:2521: gcc -c   conftest.c >&5configure:2527: $? = 0configure:2544: result: yesconfigure:2549: checking whether gcc accepts -gconfigure:2579: gcc -c -g  conftest.c >&5configure:2585: $? = 0configure:2684: result: yesconfigure:2701: checking for gcc option to accept ISO C89configure:2775: gcc  -c -g -O2  conftest.c >&5configure:2781: $? = 0configure:2804: result: none neededconfigure:2827: checking how to run the C preprocessorconfigure:2867: gcc -E  conftest.cconfigure:2873: $? = 0configure:2904: gcc -E  conftest.cconftest.c:8:28: ac_nonexistent.h: No such file or directoryconfigure:2910: $? = 1configure: failed program was:| /* confdefs.h.  */| #define PACKAGE_NAME ""| #define PACKAGE_TARNAME ""| #define PACKAGE_VERSION ""| #define PACKAGE_STRING ""| #define PACKAGE_BUGREPORT ""| /* end confdefs.h.  */| #include <ac_nonexistent.h>configure:2943: result: gcc -Econfigure:2972: gcc -E  conftest.cconfigure:2978: $? = 0configure:3009: gcc -E  conftest.cconftest.c:8:28: ac_nonexistent.h: No such file or directoryconfigure:3015: $? = 1configure: failed program was:| /* confdefs.h.  */| #define PACKAGE_NAME ""| #define PACKAGE_TARNAME ""| #define PACKAGE_VERSION ""| #define PACKAGE_STRING ""| #define PACKAGE_BUGREPORT ""| /* end confdefs.h.  */| #include <ac_nonexistent.h>configure:3066: checking for grep that handles long lines and -econfigure:3140: result: /bin/grepconfigure:3145: checking for egrepconfigure:3223: result: /bin/grep -Econfigure:3228: checking for ANSI C header filesconfigure:3258: gcc -c -g -O2 -pipe -ffast-math -Wall -Wno-sign-compare  -I../common conftest.c >&5configure:3264: $? = 0configure:3363: gcc -o conftest -g -O2 -pipe -ffast-math -Wall -Wno-sign-compare  -I../common  conftest.c  >&5configure:3366: $? = 0configure:3372: ./conftest./configure: line 3373:  5339 Segmentation fault      ./conftest$ac_exeextconfigure:3375: $? = 139configure: program exited with status 139configure: failed program was:| /* confdefs.h.  */| #define PACKAGE_NAME ""| #define PACKAGE_TARNAME ""| #define PACKAGE_VERSION ""| #define PACKAGE_STRING ""| #define PACKAGE_BUGREPORT ""| /* end confdefs.h.  */| #include <ctype.h>| #include <stdlib.h>| #if ((' ' & 0x0FF) == 0x020)| # define ISLOWER(c) ('a' <= (c) && (c) <= 'z')| # define TOUPPER(c) (ISLOWER(c) ? 'A' + ((c) - 'a') : (c))| #else| # define ISLOWER(c) 		   (('a' <= (c) && (c) <= 'i') 		     || ('j' <= (c) && (c) <= 'r') 		     || ('s' <= (c) && (c) <= 'z'))| # define TOUPPER(c) (ISLOWER(c) ? ((c) | 0x40) : (c))| #endif| | #define XOR(e, f) (((e) && !(f)) || (!(e) && (f)))| int| main ()| {|   int i;|   for (i = 0; i < 256; i++)|     if (XOR (islower (i), ISLOWER (i))| 	|| toupper (i) != TOUPPER (i))|       return 2;|   return 0;| }configure:3392: result: noconfigure:3416: checking for sys/types.hconfigure:3437: gcc -c -g -O2 -pipe -ffast-math -Wall -Wno-sign-compare  -I../common conftest.c >&5configure:3443: $? = 0configure:3459: result: yesconfigure:3416: checking for sys/stat.hconfigure:3437: gcc -c -g -O2 -pipe -ffast-math -Wall -Wno-sign-compare  -I../common conftest.c >&5configure:3443: $? = 0configure:3459: result: yesconfigure:3416: checking for stdlib.hconfigure:3437: gcc -c -g -O2 -pipe -ffast-math -Wall -Wno-sign-compare  -I../common conftest.c >&5configure:3443: $? = 0configure:3459: result: yesconfigure:3416: checking for string.hconfigure:3437: gcc -c -g -O2 -pipe -ffast-math -Wall -Wno-sign-compare  -I../common conftest.c >&5configure:3443: $? = 0configure:3459: result: yesconfigure:3416: checking for memory.hconfigure:3437: gcc -c -g -O2 -pipe -ffast-math -Wall -Wno-sign-compare  -I../common conftest.c >&5configure:3443: $? = 0configure:3459: result: yesconfigure:3416: checking for strings.hconfigure:3437: gcc -c -g -O2 -pipe -ffast-math -Wall -Wno-sign-compare  -I../common conftest.c >&5configure:3443: $? = 0configure:3459: result: yesconfigure:3416: checking for inttypes.hconfigure:3437: gcc -c -g -O2 -pipe -ffast-math -Wall -Wno-sign-compare  -I../common conftest.c >&5configure:3443: $? = 0configure:3459: result: yesconfigure:3416: checking for stdint.hconfigure:3437: gcc -c -g -O2 -pipe -ffast-math -Wall -Wno-sign-compare  -I../common conftest.c >&5configure:3443: $? = 0configure:3459: result: yesconfigure:3416: checking for unistd.hconfigure:3437: gcc -c -g -O2 -pipe -ffast-math -Wall -Wno-sign-compare  -I../common conftest.c >&5configure:3443: $? = 0configure:3459: result: yesconfigure:3471: checking whether byte ordering is bigendianconfigure:3504: gcc -c -g -O2 -pipe -ffast-math -Wall -Wno-sign-compare  -I../common conftest.c >&5configure:3510: $? = 0configure:3542: gcc -c -g -O2 -pipe -ffast-math -Wall -Wno-sign-compare  -I../common conftest.c >&5conftest.c: In function `main':conftest.c:24: error: `not' undeclared (first use in this function)conftest.c:24: error: (Each undeclared identifier is reported only onceconftest.c:24: error: for each function it appears in.)conftest.c:24: error: syntax error before "big"configure:3548: $? = 1configure: failed program was:| /* confdefs.h.  */| #define PACKAGE_NAME ""| #define PACKAGE_TARNAME ""| #define PACKAGE_VERSION ""| #define PACKAGE_STRING ""| #define PACKAGE_BUGREPORT ""| #define HAVE_SYS_TYPES_H 1| #define HAVE_SYS_STAT_H 1| #define HAVE_STDLIB_H 1| #define HAVE_STRING_H 1| #define HAVE_MEMORY_H 1| #define HAVE_STRINGS_H 1| #define HAVE_INTTYPES_H 1| #define HAVE_STDINT_H 1| #define HAVE_UNISTD_H 1| /* end confdefs.h.  */| #include <sys/types.h>| #include <sys/param.h>| | int| main ()| {| #if BYTE_ORDER != BIG_ENDIAN|  not big endian| #endif| |   ;|   return 0;| }configure:3688: result: noconfigure:3705: checking whether pointers can be stored in ints (old code)configure:3729: gcc -c -g -O2 -pipe -ffast-math -Wall -Wno-sign-compare  -I../common conftest.c >&5conftest.c:17: error: size of array `test_array' is negativeconftest.c:17: warning: 'test_array' defined but not usedconfigure:3735: $? = 1configure: failed program was:| /* confdefs.h.  */| #define PACKAGE_NAME ""| #define PACKAGE_TARNAME ""| #define PACKAGE_VERSION ""| #define PACKAGE_STRING ""| #define PACKAGE_BUGREPORT ""| #define HAVE_SYS_TYPES_H 1| #define HAVE_SYS_STAT_H 1| #define HAVE_STDLIB_H 1| #define HAVE_STRING_H 1| #define HAVE_MEMORY_H 1| #define HAVE_STRINGS_H 1| #define HAVE_INTTYPES_H 1| #define HAVE_STDINT_H 1| #define HAVE_UNISTD_H 1| /* end confdefs.h.  */| static int test_array[((long int)sizeof(int)) == ((long int)sizeof(void*)) ? 1 : -1];| int| main ()| {| |   ;|   return 0;| }configure:3774: gcc -c -g -O2 -pipe -ffast-math -Wall -Wno-sign-compare -m32  -I../common conftest.c >&5conftest.c:17: warning: 'test_array' defined but not usedconfigure:3780: $? = 0configure:3796: result: yes (with -m32)configure:3805: checking whether gcc supports -Wno-unused-parameterconfigure:3818: gcc -c -g -O2 -pipe -ffast-math -Wall -Wno-sign-compare -m32 -Wno-unused-parameter  -I../common conftest.c >&5configure:3824: $? = 0configure:3829: result: yesconfigure:3846: checking whether gcc supports -Wno-pointer-signconfigure:3859: gcc -c -g -O2 -pipe -ffast-math -Wall -Wno-sign-compare -m32 -Wno-unused-parameter -Wno-pointer-sign  -I../common conftest.c >&5cc1: error: unrecognized command line option "-Wno-pointer-sign"configure:3865: $? = 1configure: failed program was:| int foo;configure:3877: result: noconfigure:3887: checking whether gcc supports -Wno-switchconfigure:3900: gcc -c -g -O2 -pipe -ffast-math -Wall -Wno-sign-compare -m32 -Wno-unused-parameter -Wno-switch  -I../common conftest.c >&5configure:3906: $? = 0configure:3911: result: yesconfigure:4387: checking for inflateEnd in -lzconfigure:4422: gcc -o conftest -g -O2 -pipe -ffast-math -Wall -Wno-sign-compare -m32 -Wno-unused-parameter -Wno-switch  -I../common -I/usr/include  -m32 -L/usr/lib conftest.c -lz   >&5/usr/bin/ld: skipping incompatible /usr/lib/libz.so when searching for -lz/usr/bin/ld: skipping incompatible /usr/lib/libz.a when searching for -lz/usr/bin/ld: skipping incompatible /usr/lib/libc.so when searching for -lc/usr/bin/ld: skipping incompatible /usr/lib/libc.a when searching for -lcconfigure:4428: $? = 0configure:4446: result: yesconfigure:4471: checking zlib.h usabilityconfigure:4488: gcc -c -g -O2 -pipe -ffast-math -Wall -Wno-sign-compare -m32 -Wno-unused-parameter -Wno-switch  -I../common -I/usr/include conftest.c >&5configure:4494: $? = 0configure:4508: result: yesconfigure:4512: checking zlib.h presenceconfigure:4527: gcc -E  -I../common -I/usr/include conftest.cconfigure:4533: $? = 0configure:4547: result: yesconfigure:4575: checking for zlib.hconfigure:4582: result: yesconfigure:4601: checking for sqrt in -lmconfigure:4636: gcc -o conftest -g -O2 -pipe -ffast-math -Wall -Wno-sign-compare -m32 -Wno-unused-parameter -Wno-switch  -I../common -I/usr/include  -m32 -L/usr/lib conftest.c -lm  -lz  >&5conftest.c:25: warning: conflicting types for built-in function 'sqrt'/usr/bin/ld: skipping incompatible /usr/lib/libm.so when searching for -lm/usr/bin/ld: skipping incompatible /usr/lib/libm.a when searching for -lm/usr/bin/ld: skipping incompatible /usr/lib/libz.so when searching for -lz/usr/bin/ld: skipping incompatible /usr/lib/libz.a when searching for -lz/usr/bin/ld: skipping incompatible /usr/lib/libc.so when searching for -lc/usr/bin/ld: skipping incompatible /usr/lib/libc.a when searching for -lcconfigure:4642: $? = 0configure:4660: result: yesconfigure:4681: checking for clock_gettime in -lrtconfigure:4716: gcc -o conftest -g -O2 -pipe -ffast-math -Wall -Wno-sign-compare -m32 -Wno-unused-parameter -Wno-switch  -I../common -I/usr/include  -m32 -L/usr/lib conftest.c -lrt  -lm -lz  >&5/usr/bin/ld: skipping incompatible /usr/lib/librt.so when searching for -lrt/usr/bin/ld: skipping incompatible /usr/lib/librt.a when searching for -lrt/usr/bin/ld: skipping incompatible /usr/lib/libm.so when searching for -lm/usr/bin/ld: skipping incompatible /usr/lib/libm.a when searching for -lm/usr/bin/ld: skipping incompatible /usr/lib/libz.so when searching for -lz/usr/bin/ld: skipping incompatible /usr/lib/libz.a when searching for -lz/usr/bin/ld: skipping incompatible /usr/lib/libc.so when searching for -lc/usr/bin/ld: skipping incompatible /usr/lib/libc.a when searching for -lcconfigure:4722: $? = 0configure:4740: result: yesconfigure:4767: checking for mysql_configconfigure:4785: found /usr/bin/mysql_configconfigure:4798: result: /usr/bin/mysql_configconfigure:4815: checking for mysql_init in -lmysqlclientconfigure:4850: gcc -o conftest -g -O2 -pipe -ffast-math -Wall -Wno-sign-compare -m32 -Wno-unused-parameter -Wno-switch  -I../common -I/usr/include -I/usr/include/mysql  -m32 -L/usr/lib -L/usr/lib/mysql -lmysqlclient conftest.c -lmysqlclient  -lrt -lm -lz  >&5/usr/bin/ld: skipping incompatible /usr/lib/libmysqlclient.so when searching for -lmysqlclient/usr/bin/ld: skipping incompatible /usr/lib/libmysqlclient.a when searching for -lmysqlclient/usr/bin/ld: skipping incompatible /usr/lib/libmysqlclient.so when searching for -lmysqlclient/usr/bin/ld: skipping incompatible /usr/lib/libmysqlclient.a when searching for -lmysqlclient/usr/bin/ld: skipping incompatible /usr/lib/librt.so when searching for -lrt/usr/bin/ld: skipping incompatible /usr/lib/librt.a when searching for -lrt/usr/bin/ld: skipping incompatible /usr/lib/libm.so when searching for -lm/usr/bin/ld: skipping incompatible /usr/lib/libm.a when searching for -lm/usr/bin/ld: skipping incompatible /usr/lib/libz.so when searching for -lz/usr/bin/ld: skipping incompatible /usr/lib/libz.a when searching for -lz/usr/bin/ld: skipping incompatible /usr/lib/libc.so when searching for -lc/usr/bin/ld: skipping incompatible /usr/lib/libc.a when searching for -lc/usr/lib/gcc/x86_64-linux-gnu/3.4.6/../../../../lib32/libmysqlclient.a(crypto_wrapper.o): In function `yaSSL::HMAC_SHA::get_digest(unsigned char*)':(.text+0x233): undefined reference to `TaoCrypt::HMAC<TaoCrypt::SHA>::Final(unsigned char*)'/usr/lib/gcc/x86_64-linux-gnu/3.4.6/../../../../lib32/libmysqlclient.a(crypto_wrapper.o): In function `yaSSL::HMAC_SHA::get_digest(unsigned char*, unsigned char const*, unsigned int)':(.text+0x281): undefined reference to `TaoCrypt::HMAC<TaoCrypt::SHA>::Final(unsigned char*)'/usr/lib/gcc/x86_64-linux-gnu/3.4.6/../../../../lib32/libmysqlclient.a(crypto_wrapper.o): In function `yaSSL::RSA::sign(unsigned char*, unsigned char const*, unsigned int, yaSSL::RandomPool const&)':(.text+0x393): undefined reference to `TaoCrypt::RSA_Decryptor<TaoCrypt::RSA_BlockType2>::SSL_Sign(unsigned char const*, unsigned int, unsigned char*, TaoCrypt::RandomNumberGenerator&)'/usr/lib/gcc/x86_64-linux-gnu/3.4.6/../../../../lib32/libmysqlclient.a(crypto_wrapper.o): In function `yaSSL::RSA::decrypt(unsigned char*, unsigned char const*, unsigned int, yaSSL::RandomPool const&)':(.text+0xed3): undefined reference to `TaoCrypt::RSA_Decryptor<TaoCrypt::RSA_BlockType2>::Decrypt(unsigned char const*, unsigned int, unsigned char*, TaoCrypt::RandomNumberGenerator&)'collect2: ld returned 1 exit statusconfigure:4856: $? = 1configure: failed program was:| /* confdefs.h.  */| #define PACKAGE_NAME ""| #define PACKAGE_TARNAME ""| #define PACKAGE_VERSION ""| #define PACKAGE_STRING ""| #define PACKAGE_BUGREPORT ""| #define HAVE_SYS_TYPES_H 1| #define HAVE_SYS_STAT_H 1| #define HAVE_STDLIB_H 1| #define HAVE_STRING_H 1| #define HAVE_MEMORY_H 1| #define HAVE_STRINGS_H 1| #define HAVE_INTTYPES_H 1| #define HAVE_STDINT_H 1| #define HAVE_UNISTD_H 1| #define HAVE_LIBZ 1| #define HAVE_LIBM 1| #define HAVE_LIBRT 1| /* end confdefs.h.  */| | /* Override any GCC internal prototype to avoid an error.|    Use char because int might match the return type of a GCC|    builtin and then its argument prototype would still apply.  */| #ifdef __cplusplus| extern "C"| #endif| char mysql_init ();| int| main ()| {| return mysql_init ();|   ;|   return 0;| }configure:4874: result: noconfigure:4890: checking mysql.h usabilityconfigure:4907: gcc -c -g -O2 -pipe -ffast-math -Wall -Wno-sign-compare -m32 -Wno-unused-parameter -Wno-switch  -I../common -I/usr/include -I/usr/include/mysql conftest.c >&5configure:4913: $? = 0configure:4927: result: yesconfigure:4931: checking mysql.h presenceconfigure:4946: gcc -E  -I../common -I/usr/include -I/usr/include/mysql conftest.cconfigure:4952: $? = 0configure:4966: result: yesconfigure:4994: checking for mysql.hconfigure:5001: result: yesconfigure:5015: checking MySQL library (optional)configure:5021: result: noconfigure:5028: disabling MySQL (optional)configure:5055: checking for pcre_study in -lpcreconfigure:5090: gcc -o conftest -g -O2 -pipe -ffast-math -Wall -Wno-sign-compare -m32 -Wno-unused-parameter -Wno-switch  -I../common -I/usr/include  -m32 -L/usr/lib conftest.c -lpcre  -lrt -lm -lz  >&5/usr/bin/ld: cannot find -lpcrecollect2: ld returned 1 exit statusconfigure:5096: $? = 1configure: failed program was:| /* confdefs.h.  */| #define PACKAGE_NAME ""| #define PACKAGE_TARNAME ""| #define PACKAGE_VERSION ""| #define PACKAGE_STRING ""| #define PACKAGE_BUGREPORT ""| #define HAVE_SYS_TYPES_H 1| #define HAVE_SYS_STAT_H 1| #define HAVE_STDLIB_H 1| #define HAVE_STRING_H 1| #define HAVE_MEMORY_H 1| #define HAVE_STRINGS_H 1| #define HAVE_INTTYPES_H 1| #define HAVE_STDINT_H 1| #define HAVE_UNISTD_H 1| #define HAVE_LIBZ 1| #define HAVE_LIBM 1| #define HAVE_LIBRT 1| /* end confdefs.h.  */| | /* Override any GCC internal prototype to avoid an error.|    Use char because int might match the return type of a GCC|    builtin and then its argument prototype would still apply.  */| #ifdef __cplusplus| extern "C"| #endif| char pcre_study ();| int| main ()| {| return pcre_study ();|   ;|   return 0;| }configure:5114: result: noconfigure:5198: checking PCRE library (optional)configure:5204: result: noconfigure:5211: disabling PCRE (optional)configure:5225: checking host OSconfigure:5228: result: Linuxconfigure:5253: checking for MinGWconfigure:5264: result: noconfigure:5401: creating ./config.status## ---------------------- #### Running config.status. #### ---------------------- ##This file was extended by config.status, which wasgenerated by GNU Autoconf 2.61.  Invocation command line was  CONFIG_FILES    =   CONFIG_HEADERS  =   CONFIG_LINKS    =   CONFIG_COMMANDS =   $ ./config.status on server.infinite-studio.comconfig.status:594: creating Makefileconfig.status:594: creating src/common/Makefileconfig.status:594: creating src/char/Makefileconfig.status:594: creating src/login/Makefileconfig.status:594: creating src/ladmin/Makefileconfig.status:594: creating src/char_sql/Makefileconfig.status:594: creating src/login_sql/Makefileconfig.status:594: creating src/txt-converter/Makefileconfig.status:594: creating src/map/Makefileconfig.status:594: creating src/plugins/Makefileconfig.status:594: creating src/tool/Makefile## ---------------- #### Cache variables. #### ---------------- ##ac_cv_c_bigendian=noac_cv_c_compiler_gnu=yesac_cv_env_CC_set=ac_cv_env_CC_value=ac_cv_env_CFLAGS_set=ac_cv_env_CFLAGS_value=ac_cv_env_CPPFLAGS_set=ac_cv_env_CPPFLAGS_value=ac_cv_env_CPP_set=ac_cv_env_CPP_value=ac_cv_env_LDFLAGS_set=ac_cv_env_LDFLAGS_value=ac_cv_env_LIBS_set=ac_cv_env_LIBS_value=ac_cv_env_build_alias_set=ac_cv_env_build_alias_value=ac_cv_env_host_alias_set=ac_cv_env_host_alias_value=ac_cv_env_target_alias_set=ac_cv_env_target_alias_value=ac_cv_header_inttypes_h=yesac_cv_header_memory_h=yesac_cv_header_mysql_h=yesac_cv_header_stdc=noac_cv_header_stdint_h=yesac_cv_header_stdlib_h=yesac_cv_header_string_h=yesac_cv_header_strings_h=yesac_cv_header_sys_stat_h=yesac_cv_header_sys_types_h=yesac_cv_header_unistd_h=yesac_cv_header_zlib_h=yesac_cv_lib_m_sqrt=yesac_cv_lib_mysqlclient_mysql_init=noac_cv_lib_pcre_pcre_study=noac_cv_lib_rt_clock_gettime=yesac_cv_lib_z_inflateEnd=yesac_cv_objext=oac_cv_path_EGREP='/bin/grep -E'ac_cv_path_GREP=/bin/grepac_cv_path_MYSQL_CONFIG_HOME=/usr/bin/mysql_configac_cv_prog_CPP='gcc -E'ac_cv_prog_ac_ct_CC=gccac_cv_prog_cc_c89=ac_cv_prog_cc_g=yesac_cv_prog_make_make_set=yes## ----------------- #### Output variables. #### ----------------- ##CC='gcc'CFLAGS='-g -O2 -pipe -ffast-math -Wall -Wno-sign-compare -m32 -Wno-unused-parameter -Wno-switch'CPP='gcc -E'CPPFLAGS=' -I../common -I/usr/include'DEFS='-DPACKAGE_NAME=\"\" -DPACKAGE_TARNAME=\"\" -DPACKAGE_VERSION=\"\" -DPACKAGE_STRING=\"\" -DPACKAGE_BUGREPORT=\"\" -DHAVE_SYS_TYPES_H=1 -DHAVE_SYS_STAT_H=1 -DHAVE_STDLIB_H=1 -DHAVE_STRING_H=1 -DHAVE_MEMORY_H=1 -DHAVE_STRINGS_H=1 -DHAVE_INTTYPES_H=1 -DHAVE_STDINT_H=1 -DHAVE_UNISTD_H=1 -DHAVE_LIBZ=1 -DHAVE_LIBM=1 -DHAVE_LIBRT=1'DLLEXT='.so'ECHO_C=''ECHO_N='-n'ECHO_T=''EGREP='/bin/grep -E'EXEEXT=''GREP='/bin/grep'HAVE_MYSQL=''HAVE_PCRE=''LDFLAGS=' -m32 -L/usr/lib'LIBOBJS=''LIBS='-lrt -lm -lz  -ldl'LTLIBOBJS=''MYSQL_CFLAGS=''MYSQL_CONFIG_HOME='/usr/bin/mysql_config'MYSQL_LIBS=''MYSQL_VERSION=''OBJEXT='o'PACKAGE_BUGREPORT=''PACKAGE_NAME=''PACKAGE_STRING=''PACKAGE_TARNAME=''PACKAGE_VERSION=''PATH_SEPARATOR=':'PCRE_CFLAGS=''PCRE_LIBS=''SET_MAKE=''SHELL='/bin/sh'ac_ct_CC='gcc'bindir='${exec_prefix}/bin'build_alias=''datadir='${datarootdir}'datarootdir='${prefix}/share'docdir='${datarootdir}/doc/${PACKAGE}'dvidir='${docdir}'exec_prefix='${prefix}'host_alias=''htmldir='${docdir}'includedir='${prefix}/include'infodir='${datarootdir}/info'libdir='${exec_prefix}/lib'libexecdir='${exec_prefix}/libexec'localedir='${datarootdir}/locale'localstatedir='${prefix}/var'mandir='${datarootdir}/man'oldincludedir='/usr/include'pdfdir='${docdir}'prefix='/usr/local'program_transform_name='s,x,x,'psdir='${docdir}'sbindir='${exec_prefix}/sbin'sharedstatedir='${prefix}/com'sysconfdir='${prefix}/etc'target_alias=''## ----------- #### confdefs.h. #### ----------- ###define PACKAGE_NAME ""#define PACKAGE_TARNAME ""#define PACKAGE_VERSION ""#define PACKAGE_STRING ""#define PACKAGE_BUGREPORT ""#define HAVE_SYS_TYPES_H 1#define HAVE_SYS_STAT_H 1#define HAVE_STDLIB_H 1#define HAVE_STRING_H 1#define HAVE_MEMORY_H 1#define HAVE_STRINGS_H 1#define HAVE_INTTYPES_H 1#define HAVE_STDINT_H 1#define HAVE_UNISTD_H 1#define HAVE_LIBZ 1#define HAVE_LIBM 1#define HAVE_LIBRT 1configure: exit 0