All pastes #835760 Raw Edit

Anonymous

public text v1 · immutable
#835760 ·published 2007-12-29 00:50 UTC
rendered paste body
launcher.c: In function 'launcher_load_from_gconf':
launcher.c:465: warning: 'loaded' may be used uninitialized in this function
if i686-pc-linux-gnu-gcc -DHAVE_CONFIG_H -I. -I. -I.. -I. -I. -I../gnome-panel -DPANEL_DEBUG -DGNOMELOCALEDIR=\""/usr/share/locale"\" -DGLADEDIR=\""/usr/share/gnome-panel/glade"\" -DICONDIR=\""/usr/share/gnome-panel/pixmaps"\" -DGMENU_I_KNOW_THIS_IS_UNSTABLE  -DPREFIX=\""/usr"\" -DSYSCONFDIR=\""/etc"\" -DLIBDIR=\""/usr/lib"\" -DDATADIR=\""/usr/share"\"  -DORBIT2=1 -pthread -I/usr/include/orbit-2.0 -I/usr/include/glib-2.0 -I/usr/lib/glib-2.0/include -I/usr/include/gtk-2.0 -I/usr/include/pango-1.0 -I/usr/lib/gtk-2.0/include -I/usr/include/atk-1.0 -I/usr/include/cairo -I/usr/include/freetype2 -I/usr/include/libpng12 -I/usr/include/libgnome-2.0 -I/usr/include/gconf/2 -I/usr/include/gnome-vfs-2.0 -I/usr/lib/gnome-vfs-2.0/include -I/usr/include/libbonobo-2.0 -I/usr/include/bonobo-activation-2.0 -I/usr/include/libgnomeui-2.0 -I/usr/include/libart-2.0 -I/usr/include/gnome-keyring-1 -I/usr/include/libbonoboui-2.0 -I/usr/include/libgnomecanvas-2.0 -I/usr/include/libxml2 -I/usr/include/gail-1.0 -I/usr/include/gnome-desktop-2.0 -I/usr/include/startup-notification-1.0 -I/usr/include/libglade-2.0 -I/usr/include/gnome-menus -I/usr/include/dbus-1.0 -I/usr/lib/dbus-1.0/include    -Wall -Wmissing-prototypes -Wnested-externs -Wpointer-arith -Wno-sign-compare      -Os -mtune=athlon-xp -pipe -fomit-frame-pointer -MT panel-shell.o -MD -MP -MF ".deps/panel-shell.Tpo" -c -o panel-shell.o panel-shell.c; \
        then mv -f ".deps/panel-shell.Tpo" ".deps/panel-shell.Po"; else rm -f ".deps/panel-shell.Tpo"; exit 1; fi
panel-applet-frame.c: In function 'panel_applet_frame_set_flags_from_any':
panel-applet-frame.c:188: error: expected expression before 'do'
make[3]: *** [panel-applet-frame.o] Error 1
make[3]: *** Waiting for unfinished jobs....
make[3]: Leaving directory `/var/tmp/portage/gnome-base/gnome-panel-2.20.1/work/gnome-panel-2.20.1/gnome-panel'
make[2]: *** [all] Error 2
make[2]: Leaving directory `/var/tmp/portage/gnome-base/gnome-panel-2.20.1/work/gnome-panel-2.20.1/gnome-panel'
make[1]: *** [all-recursive] Error 1
make[1]: Leaving directory `/var/tmp/portage/gnome-base/gnome-panel-2.20.1/work/gnome-panel-2.20.1'
make: *** [all] Error 2
 * 
 * ERROR: gnome-base/gnome-panel-2.20.1 failed.
 * Call stack:
 *       ebuild.sh, line 1701:  Called dyn_compile
 *       ebuild.sh, line 1039:  Called qa_call 'src_compile'
 *       ebuild.sh, line   44:  Called src_compile
 *       ebuild.sh, line 1383:  Called gnome2_src_compile
 *   gnome2.eclass, line   71:  Called die
 * The specific snippet of code:
 *      emake || die "compile failure"
 *  The die message:
 *   compile failure
 * 
 * If you need support, post the topmost build error, and the call stack if relevant.
 * A complete build log is located at '/var/tmp/portage/gnome-base/gnome-panel-2.20.1/temp/build.log'.
 *