rendered paste body[ 12%] Building CXX object languages/cpp/cppduchain/CMakeFiles/kdev4cppduchain.d
ir/type_visitor.obj
In file included from D:/cygopt/kde-root/include/kdevplatform/language/duchain/d
uchainbase.h:24,
from D:/cygopt/kde-root/include/kdevplatform/language/duchain/d
ucontext.h:28,
from D:\sources\trunk\KDE\kdevelop\languages\cpp\cppduchain\typ
e_visitor.h:31,
from D:\sources\trunk\KDE\kdevelop\languages\cpp\cppduchain\typ
e_visitor.cpp:20:
D:/cygopt/kde-root/include/kdevplatform/editor/hashedstring.h:82: warning: inlin
e function `uint KDevelop::qHash(const KDevelop::HashedString&)' declared as dll
import: attribute ignored
Linking CXX shared library ../../../bin/libkdev4cppduchain.dll
Creating library file: ../../../bin/libkdev4cppduchain.dll.a
CMakeFiles/kdev4cppduchain.dir/templatedeclaration.obj: In function `ZNK3Cpp26Sp
ecialTemplateDeclarationIN8KDevelop18ForwardDeclarationEE7resolveEPKNS1_12TopDUC
ontextE':
D:/sources/trunk/KDE/kdevelop/languages/cpp/cppduchain/templatedeclaration.cpp:5
87: multiple definition of `Cpp::SpecialTemplateDeclaration<KDevelop::ForwardDec
laration>::resolve(KDevelop::TopDUContext const*) const'
CMakeFiles/kdev4cppduchain.dir/declarationbuilder.obj:D:/sources/trunk/KDE/kdeve
lop/languages/cpp/cppduchain/declarationbuilder.cpp:(.text$_ZNK3Cpp26SpecialTemp
lateDeclarationIN8KDevelop18ForwardDeclarationEE7resolveEPKNS1_12TopDUContextE[C
pp::SpecialTemplateDeclaration<KDevelop::ForwardDeclaration>::resolve(KDevelop::
TopDUContext const*) const]+0x0): first defined here
collect2: ld returned 1 exit status
mingw32-make[2]: *** [bin/libkdev4cppduchain.dll] Error 1
mingw32-make[1]: *** [languages/cpp/cppduchain/CMakeFiles/kdev4cppduchain.dir/al
l] Error 2
mingw32-make: *** [all] Error 2