All pastes #833191 Raw Edit

Untitled

public shellscript v1 · immutable
#833191 ·published 2007-12-27 00:44 UTC
rendered paste body
-DGNOME_CUPS_MANAGER_DATADIR=\""/usr/share/gnome-cups-manager"\" -DGNOME_CUPS_MANAGER_PIXMAPDIR=\""/usr/share/pixmaps/gnome-cups-manager"\" -DLIBDIR=\""/usr/lib"\" -DGNOMELOCALEDIR=\""/usr/share/locale"\"    -Os -mtune=athlon-xp -pipe -fomit-frame-pointer -MT gnome-cups-manager.o -MD -MP -MF ".deps/gnome-cups-manager.Tpo" \          -c -o gnome-cups-manager.o `test -f 'gnome-cups-manager.c' || echo './'`gnome-cups-manager.c; \        then mv -f ".deps/gnome-cups-manager.Tpo" ".deps/gnome-cups-manager.Po"; \        else rm -f ".deps/gnome-cups-manager.Tpo"; exit 1; \        fignome-cups-manager.c: In function 'event_cb':gnome-cups-manager.c:79: error: expected expression before 'do'gnome-cups-manager.c: In function 'show_printer':gnome-cups-manager.c:156: error: expected expression before 'do'gnome-cups-manager.c: In function 'printer_properties':gnome-cups-manager.c:172: error: expected expression before 'do'gnome-cups-manager.c: In function 'view_printers':gnome-cups-manager.c:188: error: expected expression before 'do'make[3]: *** [gnome-cups-manager.o] Error 1make[3]: *** Waiting for unfinished jobs....make[3]: Leaving directory `/var/tmp/portage/net-print/gnome-cups-manager-0.31-r2/work/gnome-cups-manager-0.31/gnome-cups-manager'make[2]: *** [all] Error 2make[2]: Leaving directory `/var/tmp/portage/net-print/gnome-cups-manager-0.31-r2/work/gnome-cups-manager-0.31/gnome-cups-manager'make[1]: *** [all-recursive] Error 1make[1]: Leaving directory `/var/tmp/portage/net-print/gnome-cups-manager-0.31-r2/work/gnome-cups-manager-0.31'make: *** [all] Error 2 *  * ERROR: net-print/gnome-cups-manager-0.31-r2 failed. * Call stack: *       ebuild.sh, line 1701:  Called dyn_compile *       ebuild.sh, line 1039:  Called qa_call 'src_compile' *       ebuild.sh, line   44:  Called src_compile *       ebuild.sh, line 1383:  Called gnome2_src_compile *   gnome2.eclass, line   71:  Called die * The specific snippet of code: *      emake || die "compile failure" *  The die message: *   compile failure *  * If you need support, post the topmost build error, and the call stack if relevant. * A complete build log is located at '/var/tmp/portage/net-print/gnome-cups-manager-0.31-r2/temp/build.log'. *