All pastes #832861 Raw Edit

xulrunner

public text v1 · immutable
#832861 ·published 2007-12-26 18:33 UTC
rendered paste body
***** 181_sonames-v3.patch *****

================================

PATCH COMMAND:	 patch -p0 -g0 -E --no-backup-if-mismatch < /usr/portage/local/mozilla/net-libs/xulrunner/files/181_sonames-v3.patch

================================
patching file embedding/browser/gtk/src/Makefile.in
Hunk #1 FAILED at 45.
1 out of 1 hunk FAILED -- saving rejects to file embedding/browser/gtk/src/Makefile.in.rej
patching file js/src/Makefile.in
Hunk #1 succeeded at 48 with fuzz 2.
patching file toolkit/library/Makefile.in
patching file xpcom/stub/Makefile.in
patching file xpcom/stub/Makefile.in
Hunk #1 succeeded at 67 with fuzz 1 (offset 2 lines).
patching file configure.in
Hunk #1 succeeded at 1233 (offset 26 lines).
Hunk #2 succeeded at 1265 (offset 27 lines).
patching file config/rules.mk
Hunk #2 succeeded at 332 (offset 2 lines).
Hunk #3 succeeded at 753 (offset 2 lines).
Hunk #4 succeeded at 763 (offset 2 lines).
Hunk #5 succeeded at 1088 (offset 13 lines).
Hunk #6 succeeded at 1126 (offset 15 lines).
Hunk #7 succeeded at 1136 (offset 15 lines).
================================

PATCH COMMAND:	 patch -p1 -g0 -E --no-backup-if-mismatch < /usr/portage/local/mozilla/net-libs/xulrunner/files/181_sonames-v3.patch

================================
can't find file to patch at input line 3
Perhaps you used the wrong -p or --strip option?
The text leading up to this was:
--------------------------
|--- embedding/browser/gtk/src/Makefile.in.orig	2007-06-09 23:11:57.000000000 +0200
|+++ embedding/browser/gtk/src/Makefile.in	2007-06-09 23:13:54.000000000 +0200
--------------------------
No file to patch.  Skipping patch.
1 out of 1 hunk ignored
can't find file to patch at input line 13
Perhaps you used the wrong -p or --strip option?
The text leading up to this was:
--------------------------
|--- js/src/Makefile.in.orig	2007-06-09 23:14:22.000000000 +0200
|+++ js/src/Makefile.in	2007-06-09 23:15:05.000000000 +0200
--------------------------
No file to patch.  Skipping patch.
1 out of 1 hunk ignored
can't find file to patch at input line 23
Perhaps you used the wrong -p or --strip option?
The text leading up to this was:
--------------------------
|--- toolkit/library/Makefile.in.orig	2007-06-09 23:15:36.000000000 +0200
|+++ toolkit/library/Makefile.in	2007-06-09 23:16:29.000000000 +0200
--------------------------
No file to patch.  Skipping patch.
1 out of 1 hunk ignored
can't find file to patch at input line 33
Perhaps you used the wrong -p or --strip option?
The text leading up to this was:
--------------------------
|--- xpcom/stub/Makefile.in.orig	2007-06-09 23:16:46.000000000 +0200
|+++ xpcom/stub/Makefile.in	2007-06-09 23:17:35.000000000 +0200
--------------------------
No file to patch.  Skipping patch.
1 out of 1 hunk ignored
can't find file to patch at input line 43
Perhaps you used the wrong -p or --strip option?
The text leading up to this was:
--------------------------
|--- xpcom/stub/Makefile.in.orig	2007-07-14 00:27:29.000000000 +0200
|+++ xpcom/stub/Makefile.in	2007-07-14 00:27:53.000000000 +0200
--------------------------
No file to patch.  Skipping patch.
1 out of 1 hunk ignored
missing header for unified diff at line 60 of patch
can't find file to patch at input line 60
Perhaps you used the wrong -p or --strip option?
The text leading up to this was:
--------------------------
|--- configure.in.orig	2007-08-03 23:26:45.000000000 +0200
|+++ configure.in	2007-08-03 23:30:54.000000000 +0200
--------------------------
No file to patch.  Skipping patch.
2 out of 2 hunks ignored
can't find file to patch at input line 84
Perhaps you used the wrong -p or --strip option?
The text leading up to this was:
--------------------------
|--- config/rules.mk.orig	2007-10-11 01:03:15.000000000 +0200
|+++ config/rules.mk	2007-10-13 11:50:13.000000000 +0200
--------------------------
No file to patch.  Skipping patch.
7 out of 7 hunks ignored
================================

PATCH COMMAND:	 patch -p2 -g0 -E --no-backup-if-mismatch < /usr/portage/local/mozilla/net-libs/xulrunner/files/181_sonames-v3.patch

================================
can't find file to patch at input line 3
Perhaps you used the wrong -p or --strip option?
The text leading up to this was:
--------------------------
|--- embedding/browser/gtk/src/Makefile.in.orig	2007-06-09 23:11:57.000000000 +0200
|+++ embedding/browser/gtk/src/Makefile.in	2007-06-09 23:13:54.000000000 +0200
--------------------------
No file to patch.  Skipping patch.
1 out of 1 hunk ignored
patching file Makefile.in
Hunk #1 FAILED at 48.
1 out of 1 hunk FAILED -- saving rejects to file Makefile.in.rej
patching file Makefile.in
Hunk #1 FAILED at 52.
1 out of 1 hunk FAILED -- saving rejects to file Makefile.in.rej
patching file Makefile.in
Hunk #1 FAILED at 44.
1 out of 1 hunk FAILED -- saving rejects to file Makefile.in.rej
patching file Makefile.in
Hunk #1 FAILED at 65.
1 out of 1 hunk FAILED -- saving rejects to file Makefile.in.rej
missing header for unified diff at line 60 of patch
can't find file to patch at input line 60
Perhaps you used the wrong -p or --strip option?
The text leading up to this was:
--------------------------
|--- configure.in.orig	2007-08-03 23:26:45.000000000 +0200
|+++ configure.in	2007-08-03 23:30:54.000000000 +0200
--------------------------
No file to patch.  Skipping patch.
2 out of 2 hunks ignored
missing header for unified diff at line 84 of patch
can't find file to patch at input line 84
Perhaps you used the wrong -p or --strip option?
The text leading up to this was:
--------------------------
|--- config/rules.mk.orig	2007-10-11 01:03:15.000000000 +0200
|+++ config/rules.mk	2007-10-13 11:50:13.000000000 +0200
--------------------------
No file to patch.  Skipping patch.
7 out of 7 hunks ignored
================================

PATCH COMMAND:	 patch -p3 -g0 -E --no-backup-if-mismatch < /usr/portage/local/mozilla/net-libs/xulrunner/files/181_sonames-v3.patch

================================
can't find file to patch at input line 3
Perhaps you used the wrong -p or --strip option?
The text leading up to this was:
--------------------------
|--- embedding/browser/gtk/src/Makefile.in.orig	2007-06-09 23:11:57.000000000 +0200
|+++ embedding/browser/gtk/src/Makefile.in	2007-06-09 23:13:54.000000000 +0200
--------------------------
No file to patch.  Skipping patch.
1 out of 1 hunk ignored
missing header for unified diff at line 13 of patch
can't find file to patch at input line 13
Perhaps you used the wrong -p or --strip option?
The text leading up to this was:
--------------------------
|--- js/src/Makefile.in.orig	2007-06-09 23:14:22.000000000 +0200
|+++ js/src/Makefile.in	2007-06-09 23:15:05.000000000 +0200
--------------------------
No file to patch.  Skipping patch.
1 out of 1 hunk ignored
missing header for unified diff at line 23 of patch
can't find file to patch at input line 23
Perhaps you used the wrong -p or --strip option?
The text leading up to this was:
--------------------------
|--- toolkit/library/Makefile.in.orig	2007-06-09 23:15:36.000000000 +0200
|+++ toolkit/library/Makefile.in	2007-06-09 23:16:29.000000000 +0200
--------------------------
No file to patch.  Skipping patch.
1 out of 1 hunk ignored
missing header for unified diff at line 33 of patch
can't find file to patch at input line 33
Perhaps you used the wrong -p or --strip option?
The text leading up to this was:
--------------------------
|--- xpcom/stub/Makefile.in.orig	2007-06-09 23:16:46.000000000 +0200
|+++ xpcom/stub/Makefile.in	2007-06-09 23:17:35.000000000 +0200
--------------------------
No file to patch.  Skipping patch.
1 out of 1 hunk ignored
missing header for unified diff at line 43 of patch
can't find file to patch at input line 43
Perhaps you used the wrong -p or --strip option?
The text leading up to this was:
--------------------------
|--- xpcom/stub/Makefile.in.orig	2007-07-14 00:27:29.000000000 +0200
|+++ xpcom/stub/Makefile.in	2007-07-14 00:27:53.000000000 +0200
--------------------------
No file to patch.  Skipping patch.
1 out of 1 hunk ignored
missing header for unified diff at line 60 of patch
can't find file to patch at input line 60
Perhaps you used the wrong -p or --strip option?
The text leading up to this was:
--------------------------
|--- configure.in.orig	2007-08-03 23:26:45.000000000 +0200
|+++ configure.in	2007-08-03 23:30:54.000000000 +0200
--------------------------
No file to patch.  Skipping patch.
2 out of 2 hunks ignored
missing header for unified diff at line 84 of patch
can't find file to patch at input line 84
Perhaps you used the wrong -p or --strip option?
The text leading up to this was:
--------------------------
|--- config/rules.mk.orig	2007-10-11 01:03:15.000000000 +0200
|+++ config/rules.mk	2007-10-13 11:50:13.000000000 +0200
--------------------------
No file to patch.  Skipping patch.
7 out of 7 hunks ignored
================================

PATCH COMMAND:	 patch -p4 -g0 -E --no-backup-if-mismatch < /usr/portage/local/mozilla/net-libs/xulrunner/files/181_sonames-v3.patch

================================
patching file Makefile.in
Hunk #1 FAILED at 45.
1 out of 1 hunk FAILED -- saving rejects to file Makefile.in.rej
missing header for unified diff at line 13 of patch
can't find file to patch at input line 13
Perhaps you used the wrong -p or --strip option?
The text leading up to this was:
--------------------------
|--- js/src/Makefile.in.orig	2007-06-09 23:14:22.000000000 +0200
|+++ js/src/Makefile.in	2007-06-09 23:15:05.000000000 +0200
--------------------------
No file to patch.  Skipping patch.
1 out of 1 hunk ignored
missing header for unified diff at line 23 of patch
can't find file to patch at input line 23
Perhaps you used the wrong -p or --strip option?
The text leading up to this was:
--------------------------
|--- toolkit/library/Makefile.in.orig	2007-06-09 23:15:36.000000000 +0200
|+++ toolkit/library/Makefile.in	2007-06-09 23:16:29.000000000 +0200
--------------------------
No file to patch.  Skipping patch.
1 out of 1 hunk ignored
missing header for unified diff at line 33 of patch
can't find file to patch at input line 33
Perhaps you used the wrong -p or --strip option?
The text leading up to this was:
--------------------------
|--- xpcom/stub/Makefile.in.orig	2007-06-09 23:16:46.000000000 +0200
|+++ xpcom/stub/Makefile.in	2007-06-09 23:17:35.000000000 +0200
--------------------------
No file to patch.  Skipping patch.
1 out of 1 hunk ignored
missing header for unified diff at line 43 of patch
can't find file to patch at input line 43
Perhaps you used the wrong -p or --strip option?
The text leading up to this was:
--------------------------
|--- xpcom/stub/Makefile.in.orig	2007-07-14 00:27:29.000000000 +0200
|+++ xpcom/stub/Makefile.in	2007-07-14 00:27:53.000000000 +0200
--------------------------
No file to patch.  Skipping patch.
1 out of 1 hunk ignored
missing header for unified diff at line 60 of patch
can't find file to patch at input line 60
Perhaps you used the wrong -p or --strip option?
The text leading up to this was:
--------------------------
|--- configure.in.orig	2007-08-03 23:26:45.000000000 +0200
|+++ configure.in	2007-08-03 23:30:54.000000000 +0200
--------------------------
No file to patch.  Skipping patch.
2 out of 2 hunks ignored
missing header for unified diff at line 84 of patch
can't find file to patch at input line 84
Perhaps you used the wrong -p or --strip option?
The text leading up to this was:
--------------------------
|--- config/rules.mk.orig	2007-10-11 01:03:15.000000000 +0200
|+++ config/rules.mk	2007-10-13 11:50:13.000000000 +0200
--------------------------
No file to patch.  Skipping patch.
7 out of 7 hunks ignored