All pastes #832672 Raw Edit

log

public text v1 · immutable
#832672 ·published 2007-12-26 13:53 UTC
rendered paste body
nvidia-installer log file '/var/log/nvidia-installer.log'
creation time: Wed Dec 26 16:36:52 2007

option status:
  license pre-accepted    : false
  update                  : false
  force update            : false
  expert                  : false
  uninstall               : false
  driver info             : false
  precompiled interfaces  : true
  no ncurses color        : false
  query latest version    : false
  OpenGL header files     : true
  no questions            : false
  silent                  : false
  no recursion            : false
  no backup               : false
  kernel module only      : false
  sanity                  : false
  add this kernel         : false
  no runlevel check       : false
  no network              : false
  no ABI note             : false
  no RPMs                 : false
  no kernel module        : false
  force SELinux           : default
  no X server check       : false
  force tls               : (not specified)
  X install prefix        : (not specified)
  X library install path  : (not specified)
  X module install path   : (not specified)
  OpenGL install prefix   : (not specified)
  OpenGL install libdir   : (not specified)
  utility install prefix  : (not specified)
  utility install libdir  : (not specified)
  doc install prefix      : (not specified)
  kernel name             : (not specified)
  kernel include path     : (not specified)
  kernel source path      : (not specified)
  kernel output path      : (not specified)
  kernel install path     : (not specified)
  proc mount point        : /proc
  ui                      : (not specified)
  tmpdir                  : /tmp
  ftp mirror              : ftp://download.nvidia.com
  RPM file list           : (not specified)

Using: nvidia-installer ncurses user interface
-> License accepted.
-> There appears to already be a driver installed on your system (version: 100.
   14.11).  As part of installing this driver (version: 100.14.11), the existin
   g driver will be uninstalled.  Are you sure you want to continue? ('no' will
   abort installation) (Answer: Yes)
-> No precompiled kernel interface was found to match your kernel; would you li
   ke the installer to attempt to download a kernel interface for your kernel f
   rom the NVIDIA ftp site (ftp://download.nvidia.com)? (Answer: Yes)
-> No matching precompiled kernel interface was found on the NVIDIA ftp site;
   this means that the installer will need to compile a kernel interface for
   your kernel.
-> Performing CC sanity check with CC="cc".
-> Performing CC version check with CC="cc".
-> Kernel source path: '/lib/modules/2.6.23.1/source'
-> Kernel output path: '/lib/modules/2.6.23.1/build'
-> Performing rivafb check.
-> Performing nvidiafb check.
-> Performing Xen check.
-> Cleaning kernel module build directory.
   executing: 'cd ./usr/src/nv; make clean'...
   rm -f -f nv.o nv-vm.o os-agp.o os-interface.o os-registry.o nv-i2c.o nvacpi.
   o nv.o nv-vm.o os-agp.o os-interface.o os-registry.o nv-i2c.o nvacpi.o nvidi
   a.mod.o
   rm -f -f build-in.o nv-linux.o *.d .*.{cmd,flags}
   rm -f -f nvidia.{o,ko,mod.{o,c}} nv_compiler.h *~
   rm -f -f stprof stprof.o symtab.h Modules.symvers
   rm -f -rf .tmp_versions
   rm -f Makefile
-> Building kernel module:
   executing: 'cd ./usr/src/nv; make module SYSSRC=/lib/modules/2.6.23.1/source
   SYSOUT=/lib/modules/2.6.23.1/build'...
   sh ./conftest.sh "cc" "cc" /lib/modules/2.6.23.1/source /lib/modules/2.6.23.
   1/build cc_sanity_check full_output
   sh ./conftest.sh "cc" "cc" /lib/modules/2.6.23.1/source /lib/modules/2.6.23.
   1/build select_makefile full_output
   make --no-print-directory -f Makefile module
   
   NVIDIA: calling KBUILD...
   make CC=cc KBUILD_OUTPUT=/lib/modules/2.6.23.1/build KBUILD_VERBOSE=1 -C /li
   b/modules/2.6.23.1/source SUBDIRS=/tmp/selfgz6879/NVIDIA-Linux-x86-100.14.11
   -pkg1/usr/src/nv modules
   make -C /lib/modules/2.6.23.1/build \
        KBUILD_SRC=/usr/src/linux-2.6.23.1 \
        KBUILD_EXTMOD="/tmp/selfgz6879/NVIDIA-Linux-x86-100.14.11-pkg1/usr/src/nv" 
   -f /usr/src/linux-2.6.23.1/Makefile modules
   test -e include/linux/autoconf.h -a -e include/config/auto.conf || (        \
        echo;                                                           \
        echo "  ERROR: Kernel configuration is invalid.";               \
        echo "         include/linux/autoconf.h or include/config/auto.conf are mis
   sing.";      \
        echo "         Run 'make oldconfig && make prepare' on kernel src to fix it
   .";  \
        echo;                                                           \
        /bin/false)
   mkdir -p /tmp/selfgz6879/NVIDIA-Linux-x86-100.14.11-pkg1/usr/src/nv/.tmp_ver
   sions
   rm -f /tmp/selfgz6879/NVIDIA-Linux-x86-100.14.11-pkg1/usr/src/nv/.tmp_versio
   ns/*
   make -f /usr/src/linux-2.6.23.1/scripts/Makefile.build obj=/tmp/selfgz6879/N
   VIDIA-Linux-x86-100.14.11-pkg1/usr/src/nv
   echo \#define NV_COMPILER \"`cc -v 2>&1 | tail -n 1`\" > /tmp/selfgz6879/NVI
   DIA-Linux-x86-100.14.11-pkg1/usr/src/nv/nv_compiler.h
     cc -Wp,-MD,/tmp/selfgz6879/NVIDIA-Linux-x86-100.14.11-pkg1/usr/src/nv/.nv.
   o.d  -nostdinc -isystem /usr/lib/gcc/i486-linux-gnu/4.1.3/include -D__KERNEL
   __ -Iinclude -Iinclude2 -I/usr/src/linux-2.6.23.1/include -include include/l
   inux/autoconf.h  -I/tmp/selfgz6879/NVIDIA-Linux-x86-100.14.11-pkg1/usr/src/n
   v -Wall -Wundef -Wstrict-prototypes -Wno-trigraphs -fno-strict-aliasing -fno
   -common -Werror-implicit-function-declaration -O2 -pipe -msoft-float -mregpa
   rm=3 -freg-struct-return -mpreferred-stack-boundary=2 -march=i686 -mtune=pen
   tium4 -mtune=generic -ffreestanding -maccumulate-outgoing-args -I/usr/src/li
   nux-2.6.23.1/include
   /asm-i386/mach-default -Iinclude/asm-i386/mach-default -fomit-frame-pointer 
   -g -fno-stack-protector -Wdeclaration-after-statement -Wno-pointer-sign  -I/
   tmp/selfgz6879/NVIDIA-Linux-x86-100.14.11-pkg1/usr/src/nv -Wall -Wimplicit -
   Wreturn-type -Wswitch -Wformat -Wchar-subscripts -Wparentheses -Wpointer-ari
   th -Wno-multichar -Werror -O -fno-common -msoft-float -MD -Wsign-compare -Wn
   o-cast-qual -Wno-error -D_LOOSE_KERNEL_NAMES -D__KERNEL__ -DMODULE -DNVRM -D
   NV_VERSION_STRING=\"100.14.11\" -UDEBUG -U_DEBUG -DNDEBUG -DNV_SIGNAL_STRUCT
   _RLIM -DNV_MULTIPLE_BRIDGE_AGPGART_PRESENT -DNV_PCI_GET_CLASS_PRESENT -DNV_S
   YSCTL_MAX_MAP_COUNT_PRESENT -DNV_PM_MESSAGE_T_PRESENT -DNV_PCI_CHOOSE_STATE_
   PRESENT -DNV_VM_INSERT_PAGE_PRESENT -DNV_OLD_MM_KGDB_BREAKPOINT_PRESENT -DNV
   _REMAP_PFN_RANGE_PRESENT -DNV_CHANGE_PAGE_ATTR_PRESENT -DNV_ACQUIRE_CONSOLE_
   SEM_PRESENT -DNV_VMAP_4_PRESENT -DMODULE -D"KBUILD_STR(s)=#s" -D"KBUILD_BASE
   NAME=KBUILD_STR(nv)"  -D"KBUILD_MODNAME=KBUILD_STR(nvidia)" -c -o /tmp/selfg
   z6879/NVIDIA-Linux-x86-100.14.11-pkg
   1/usr/src/nv/.tmp_nv.o /tmp/selfgz6879/NVIDIA-Linux-x86-100.14.11-pkg1/usr/s
   rc/nv/nv.c
   In file included from include/linux/list.h:8,
                    from include/linux/preempt.h:11,
                    from include/linux/spinlock.h:49,
                    from include/linux/seqlock.h:29,
                    from include/linux/time.h:8,
                    from include/linux/timex.h:57,
                    from include/linux/sched.h:53,
                    from include/linux/utsname.h:35,
                    from /tmp/selfgz6879/NVIDIA-Linux-x86-100.14.11-pkg1/usr/sr
   c/nv/nv-linux.h:19,
                    from /tmp/selfgz6879/NVIDIA-Linux-x86-100.14.11-pkg1/usr/sr
   c/nv/nv.c:14:
   include/linux/prefetch.h: В функции ‘prefetch_range’
   include/linux/prefetch.h:62: предупреждение: в арифмет
   ическом выражении использован указатель 
   ‘VOID *’
   /tmp/selfgz6879/NVIDIA-Linux-x86-100.14.11-pkg1/usr/src/nv/nv.c: В функ
   ции ‘__nv_setup_pat_entries’
   /tmp/selfgz6879/NVIDIA-Linux-x86-100.14.11-pkg1/usr/src/nv/nv.c:950: пре
   �упреждение: сравнение знакового и беззна
   кового значений
   /tmp/selfgz6879/NVIDIA-Linux-x86-100.14.11-pkg1/usr/src/nv/nv.c: В функ
   ции ‘__nv_restore_pat_entries’
   /tmp/selfgz6879/NVIDIA-Linux-x86-100.14.11-pkg1/usr/src/nv/nv.c:976: пре
   �упреждение: сравнение знакового и беззна
   кового значений
   /tmp/selfgz6879/NVIDIA-Linux-x86-100.14.11-pkg1/usr/src/nv/nv.c: В функ
   ции ‘nv_kern_cpu_callback’
   /tmp/selfgz6879/NVIDIA-Linux-x86-100.14.11-pkg1/usr/src/nv/nv.c:1282: пре
   дупреждение: сравнение знакового и беззн
   �кового значений
   /tmp/selfgz6879/NVIDIA-Linux-x86-100.14.11-pkg1/usr/src/nv/nv.c:1289: пре
   дупреждение: сравнение знакового и беззн
   �кового значений
   /tmp/selfgz6879/NVIDIA-Linux-x86-100.14.11-pkg1/usr/src/nv/nv.c: В функ
   ции ‘nvidia_init_module’
   /tmp/selfgz6879/NVIDIA-Linux-x86-100.14.11-pkg1/usr/src/nv/nv.c:1326: оши
   бка: слишком много аргументов в вызове фу
   �кции ‘kmem_cache_create’
   /tmp/selfgz6879/NVIDIA-Linux-x86-100.14.11-pkg1/usr/src/nv/nv.c:1435: оши
   бка: слишком много аргументов в вызове фу
   �кции ‘kmem_cache_create’
   /tmp/selfgz6879/NVIDIA-Linux-x86-100.14.11-pkg1/usr/src/nv/nv.c:1569: оши
   бка: использование пустого (void) значения
   /tmp/selfgz6879/NVIDIA-Linux-x86-100.14.11-pkg1/usr/src/nv/nv.c: В функ
   ции ‘nvidia_exit_module’
   /tmp/selfgz6879/NVIDIA-Linux-x86-100.14.11-pkg1/usr/src/nv/nv.c:1601: оши
   бка: использование пустого (void) значения
   make[4]: *** [/tmp/selfgz6879/NVIDIA-Linux-x86-100.14.11-pkg1/usr/src/nv/nv.
   o] Ошибка 1
   make[3]: *** [_module_/tmp/selfgz6879/NVIDIA-Linux-x86-100.14.11-pkg1/usr/sr
   c/nv] Ошибка 2
   make[2]: *** [modules] Ошибка 2
   NVIDIA: left KBUILD.
   nvidia.ko failed to build!
   make[1]: *** [module] Ошибка 1
   make: *** [module] Ошибка 2
-> Error.
ERROR: Unable to build the NVIDIA kernel module.
ERROR: Installation has failed.  Please see the file
       '/var/log/nvidia-installer.log' for details.  You may find suggestions
       on fixing installation problems in the README available on the Linux
       driver download page at www.nvidia.com.