Something
public text v1 · immutablei386/cavsdsp_mmx.c: In function ‘ff_put_cavs_qpel8_mc01_3dnow’:
i386/cavsdsp_mmx.c:463: error: can't find a register in class ‘GENERAL_REGS’ while reloading ‘asm’
make[1]: *** [i386/cavsdsp_mmx.o] Error 1
i386/cavsdsp_mmx.c: In function ‘ff_put_cavs_qpel8_mc01_3dnow’:
i386/cavsdsp_mmx.c:463: error: can't find a register in class ‘GENERAL_REGS’ while reloading ‘asm’
make[1]: *** [i386/cavsdsp_mmx.o] Error 1