All pastes #83226 Raw Edit

apachelogger

public text v1 · immutable
·published 2006-07-09 14:36 UTC
rendered paste body
if /bin/sh ../../libtool --silent --mode=compile --tag=CXX g++ -DHAVE_CONFIG_H -I. -I. -I../.. -I../../amarok/src/amarokcore -I../../amarok/src/amarokcore -I../../amarok/src/analyzers -I../../amarok/src/plugin -I../../amarok/src/statusbar -I../../amarok/src/mediadevice -I../../amarok/src -I/usr/include/kde/arts -I/usr/include/taglib -I../../amarok/src/sqlite -I/usr/include/mysql -DBIG_JOINS=1   -I/usr/include/kde -I/usr/share/qt3/include -I.   -DQT_THREAD_SUPPORT  -D_REENTRANT  -Wno-long-long -Wundef -ansi -D_XOPEN_SOURCE=500 -D_BSD_SOURCE -Wcast-align -Wconversion -Wchar-subscripts -Wall -W -Wpointer-arith -g3 -fno-inline -Wformat-security -Wmissing-format-attribute -Wno-non-virtual-dtor -fno-exceptions -fno-check-new -fno-common -DQT_CLEAN_NAMESPACE -DQT_NO_ASCII_CAST -DQT_NO_STL -DQT_NO_COMPAT -DQT_NO_TRANSLATION  -MT configdialog.lo -MD -MP -MF ".deps/configdialog.Tpo" \
          -c -o configdialog.lo `test -f 'configdialog.cpp' || echo './'`configdialog.cpp; \
        then mv -f ".deps/configdialog.Tpo" ".deps/configdialog.Plo"; \
        else rm -f ".deps/configdialog.Tpo"; exit 1; \
        fi
configdialog.cpp: In constructor 'AmarokConfigDialog::AmarokConfigDialog(QWidget*, const char*, KConfigSkeleton*)':
configdialog.cpp:92: error: 'Options8' was not declared in this scope
configdialog.cpp:92: error: 'opt8' was not declared in this scope
configdialog.cpp:92: error: expected type-specifier before 'Options8'
configdialog.cpp:92: error: expected `;' before 'Options8'
make[4]: *** [configdialog.lo] Error 1
make[4]: Leaving directory `/home/me/src/svn/amarok/multimedia/amarok/src'
make[3]: *** [all-recursive] Error 1
make[3]: Leaving directory `/home/me/src/svn/amarok/multimedia/amarok/src'
make[2]: *** [all-recursive] Error 1
make[2]: Leaving directory `/home/me/src/svn/amarok/multimedia/amarok'
make[1]: *** [all-recursive] Error 1
make[1]: Leaving directory `/home/me/src/svn/amarok/multimedia'
make: *** [all] Error 2