All pastes #832055 Raw Edit

Unnamed

public text v1 · immutable
#832055 ·published 2007-12-25 19:15 UTC
rendered paste body
[ 45%] Building CXX object src/CMakeFiles/amaroklib.dir/meta/file/File.obj
[ 45%] Building CXX object src/CMakeFiles/amaroklib.dir/meta/stream/Stream.obj
[ 46%] Building CXX object src/CMakeFiles/amaroklib.dir/meta/PlaylistFileSuppor
.obj
In file included from C:\kderoot\tmp\amarok-2.0.20071121\work\amarok\src\meta\P
aylistFileSupport.cpp:24:
C:/kderoot/tmp/amarok-2.0.20071121/work/amarok/src/engineobserver.h:44: warning
 `virtual void EngineObserver::engineNewMetaData(const QHash<qint64, QString>&,
bool)' was hidden
C:/kderoot/tmp/amarok-2.0.20071121/work/amarok/src/statusbar/ContextStatusBar.h
47: warning:   by `virtual void Amarok::ContextStatusBar::engineNewMetaData(con
t MetaBundle&, bool)'
C:\kderoot\tmp\amarok-2.0.20071121\work\amarok\src\meta\PlaylistFileSupport.cpp
 In function `bool Meta::saveXSPF(const Meta::TrackList&, const KUrl&, bool)':
C:\kderoot\tmp\amarok-2.0.20071121\work\amarok\src\meta\PlaylistFileSupport.cpp
138: error: cannot declare variable `playlist' to be of type `Meta::XSPFPlaylis
'
C:\kderoot\tmp\amarok-2.0.20071121\work\amarok\src\meta\PlaylistFileSupport.cpp
138: error:   because the following virtual functions are abstract:
C:/kderoot/tmp/amarok-2.0.20071121/work/amarok/src/meta/Playlist.h:53: error:
irtual KUrl Meta::Playlist::retrievableUrl()
mingw32-make[2]: *** [src/CMakeFiles/amaroklib.dir/meta/PlaylistFileSupport.obj
 Error 1
mingw32-make[1]: *** [src/CMakeFiles/amaroklib.dir/all] Error 2
mingw32-make: *** [all] Error 2
emerge fatal error: os.system ( mingw32-make -j2 ) failed
emerge fatal error: running python C:\kderoot\emerge\portage\testing\amarok\ama
ok-2.0.20071121.py compile