All pastes #831400 Raw Edit

Untitled

public text v1 · immutable
#831400 ·published 2007-12-24 22:11 UTC
rendered paste body
cups-util.c:213: warning: 'httpRead' is deprecated (declared at /usr/include/cups/http.h:361)
cups-util.c: At top level:
cups-util.c:225: warning: no previous prototype for 'cupsPutConf'
cups-util.c: In function 'cupsPutConf':
cups-util.c:308: warning: 'httpWrite' is deprecated (declared at /usr/include/cups/http.h:371)
cups-util.c:312: warning: 'httpWrite' is deprecated (declared at /usr/include/cups/http.h:371)
cups-util.c:337: error: dereferencing pointer to incomplete type
cups-util.c:337: error: dereferencing pointer to incomplete type
cups-util.c:337: error: dereferencing pointer to incomplete type
cups-util.c:337: error: dereferencing pointer to incomplete type
cups-util.c:337: error: dereferencing pointer to incomplete type
cups-util.c:337: error: dereferencing pointer to incomplete type
cups-util.c:337: error: dereferencing pointer to incomplete type
cups-util.c:337: error: dereferencing pointer to incomplete type
cups-util.c:337: error: dereferencing pointer to incomplete type
cups-util.c:337: error: dereferencing pointer to incomplete type
cups-util.c:337: error: dereferencing pointer to incomplete type
cups-util.c:337: error: dereferencing pointer to incomplete type
cups-util.c:337: error: dereferencing pointer to incomplete type
cups-util.c:337: error: dereferencing pointer to incomplete type
cups-util.c:337: error: dereferencing pointer to incomplete type
cups-util.c:337: error: dereferencing pointer to incomplete type
cups-util.c:337: error: dereferencing pointer to incomplete type
cups-util.c:337: error: dereferencing pointer to incomplete type
cups-util.c:337: error: dereferencing pointer to incomplete type
cups-util.c:337: error: dereferencing pointer to incomplete type
cups-util.c:337: error: dereferencing pointer to incomplete type
cups-util.c:337: error: dereferencing pointer to incomplete type
cups-util.c:337: error: dereferencing pointer to incomplete type
cups-util.c:345: error: dereferencing pointer to incomplete type
cups-util.c:364: error: dereferencing pointer to incomplete type
cups-util.c:364: error: dereferencing pointer to incomplete type
cups-util.c:364: error: dereferencing pointer to incomplete type
cups-util.c:364: error: dereferencing pointer to incomplete type
cups-util.c:364: error: dereferencing pointer to incomplete type
cups-util.c:364: error: dereferencing pointer to incomplete type
cups-util.c:364: error: dereferencing pointer to incomplete type
cups-util.c:364: error: dereferencing pointer to incomplete type
cups-util.c:364: error: dereferencing pointer to incomplete type
cups-util.c:364: error: dereferencing pointer to incomplete type
cups-util.c:364: error: dereferencing pointer to incomplete type
cups-util.c:364: error: dereferencing pointer to incomplete type
cups-util.c:364: error: dereferencing pointer to incomplete type
cups-util.c:364: error: dereferencing pointer to incomplete type
cups-util.c:364: error: dereferencing pointer to incomplete type
cups-util.c:364: error: dereferencing pointer to incomplete type
cups-util.c:364: error: dereferencing pointer to incomplete type
cups-util.c:364: error: dereferencing pointer to incomplete type
cups-util.c:364: error: dereferencing pointer to incomplete type
cups-util.c:364: error: dereferencing pointer to incomplete type
cups-util.c:364: error: dereferencing pointer to incomplete type
cups-util.c:364: error: dereferencing pointer to incomplete type
cups-util.c:364: error: dereferencing pointer to incomplete type
cups-util.c: In function 'cups_local_auth':
cups-util.c:454: warning: passing argument 1 of 'httpAddrLocalhost' from incompatible pointer type
make[4]: *** [cups-util.lo] Error 1
make[4]: *** Waiting for unfinished jobs....
make[3]: *** [all-recursive] Error 1
make[2]: *** [all-recursive] Error 1
make[1]: *** [all-recursive] Error 1
make: *** [all] Error 2
 * 
 * ERROR: kde-base/kdelibs-3.5.7-r2 failed.
 * Call stack:
 *               ebuild.sh, line   46:  Called src_compile
 *             environment, line 4175:  Called kde_src_compile
 *             environment, line 2823:  Called kde_src_compile 'src_compile'
 *             environment, line 2944:  Called kde_src_compile 'src_compile' 'all' 'myconf'
 *             environment, line 2940:  Called die
 * The specific snippet of code:
 *                   emake || diefunc "$FUNCNAME" "$LINENO" "$?" "died running emake, $FUNCNAME:make"
 *  The die message:
 *   died running emake, kde_src_compile:make
 * 
 * If you need support, post the topmost build error, and the call stack if relevant.
 * A complete build log is located at '/var/tmp/portage/kde-base/kdelibs-3.5.7-r2/temp/build.log'.
 * The ebuild environment file is located at '/var/tmp/portage/kde-base/kdelibs-3.5.7-r2/temp/environment'.
 * 

 * Messages for package net-print/cups-1.3.5:

 * For information about installing a printer and general cups setup
 * take a look at: http://www.gentoo.org/doc/en/printing-howto.xml
 * /usr/lib/cups exists - You need to remerge every ebuild that
 * installed into /usr/lib/cups and /etc/cups, qfile is in portage-utils:
 * # FEATURES=-collision-protect emerge -va1 $(qfile -qC /usr/lib/cups /etc/cups | sed "s:net-print/cups$::")
 * FEATURES=-collision-protect is needed to overwrite the compatibility
 * symlinks installed by this package, it won't be needed on later merges.
 * You should also run revdep-rebuild

 * Messages for package kde-base/kdelibs-3.5.7-r2:

 * On some setups, which rely on the correct update of utmp records, not using
 * utempter might not update them correctly. If you experience unexpected
 * behaviour, try to rebuild kde-base/kdelibs with utempter use-flag enabled.
 * 
 * ERROR: kde-base/kdelibs-3.5.7-r2 failed.
 * Call stack:
 *               ebuild.sh, line   46:  Called src_compile
 *             environment, line 4175:  Called kde_src_compile
 *             environment, line 2823:  Called kde_src_compile 'src_compile'
 *             environment, line 2944:  Called kde_src_compile 'src_compile' 'all' 'myconf'
 *             environment, line 2940:  Called die
 * The specific snippet of code:
 *                   emake || diefunc "$FUNCNAME" "$LINENO" "$?" "died running emake, $FUNCNAME:make"
 *  The die message:
 *   died running emake, kde_src_compile:make
 * 
 * If you need support, post the topmost build error, and the call stack if relevant.
 * A complete build log is located at '/var/tmp/portage/kde-base/kdelibs-3.5.7-r2/temp/build.log'.
 * The ebuild environment file is located at '/var/tmp/portage/kde-base/kdelibs-3.5.7-r2/temp/environment'.
 * 
 * GNU info directory index is up-to-date.
phoenix elementalnature #