rendered paste body[ 46%] Building CXX object src/CMakeFiles/amaroklib.dir/meta/PlaylistFileSupport
.obj
In file included from E:\kdesvn\trunk\extragear\multimedia\amarok\src\meta\Playl
istFileSupport.cpp:24:
E:/kdesvn/trunk/extragear/multimedia/amarok/src/engineobserver.h:44: warning: `v
irtual void EngineObserver::engineNewMetaData(const QHash<qint64, QString>&, boo
l)' was hidden
E:/kdesvn/trunk/extragear/multimedia/amarok/src/statusbar/ContextStatusBar.h:47:
warning: by `virtual void Amarok::ContextStatusBar::engineNewMetaData(const M
etaBundle&, bool)'
In file included from E:\kdesvn\trunk\extragear\multimedia\amarok\src\meta\Playl
istFileSupport.cpp:25:
E:/kdesvn/trunk/extragear/multimedia/amarok/src/meta/Playlist.h:38: warning: `vi
rtual QString Meta::Playlist::name() const' was hidden
E:\kdesvn\trunk\extragear\multimedia\amarok\src\meta\xspfplaylist.h:60: warning:
by `QString Meta::XSPFPlaylist::name()'
E:/kdesvn/trunk/extragear/multimedia/amarok/src/meta/Playlist.h:39: warning: `vi
rtual QString Meta::Playlist::prettyName() const' was hidden
E:\kdesvn\trunk\extragear\multimedia\amarok\src\meta\xspfplaylist.h:61: warning:
by `QString Meta::XSPFPlaylist::prettyName()'
E:\kdesvn\trunk\extragear\multimedia\amarok\src\meta\PlaylistFileSupport.cpp: In
function `bool Meta::saveXSPF(const Meta::TrackList&, const KUrl&, bool)':
E:\kdesvn\trunk\extragear\multimedia\amarok\src\meta\PlaylistFileSupport.cpp:138
: error: cannot declare variable `playlist' to be of type `Meta::XSPFPlaylist'
E:\kdesvn\trunk\extragear\multimedia\amarok\src\meta\PlaylistFileSupport.cpp:138
: error: because the following virtual functions are abstract:
E:/kdesvn/trunk/extragear/multimedia/amarok/src/meta/Playlist.h:38: error: virt
ual QString Meta::Playlist::name() const
E:/kdesvn/trunk/extragear/multimedia/amarok/src/meta/Playlist.h:39: error: virt
ual QString Meta::Playlist::prettyName() const
mingw32-make[2]: *** [src/CMakeFiles/amaroklib.dir/meta/PlaylistFileSupport.obj]
Error 1
mingw32-make[1]: *** [src/CMakeFiles/amaroklib.dir/all] Error 2
mingw32-make: *** [all] Error 2
emerge fatal error: os.system ( mingw32-make -j2 ) failed
emerge fatal error: running python C:\kderoot\emerge\portage\testing\amarok\amar
ok-2.0.20071121.py compile