rendered paste bodyThis file contains any messages produced by compilers while
running configure, to aid debugging if configure makes a mistake.
It was created by configure, which was
generated by GNU Autoconf 2.59. Invocation command line was
$ ./configure --with-jdk-home=/usr/lib/jvm/java-1.5.0-gcj --with-ant-home=/usr/share/ant --with-system-mozilla --with-firefox --disable-Xaw --disable-kde --disable-mono --enable-opengl --enable-ogltrans --with-mingwin=i386-mingw32-g++ --disable-ldap
## --------- ##
## Platform. ##
## --------- ##
hostname = z.localdomain
uname -m = i686
uname -r = 2.6.23.8-34.fc7
uname -s = Linux
uname -v = #1 SMP Thu Nov 22 23:05:33 EST 2007
/usr/bin/uname -p = unknown
/bin/uname -X = unknown
/bin/arch = i686
/usr/bin/arch -k = unknown
/usr/convex/getsysinfo = unknown
hostinfo = unknown
/bin/machine = unknown
/usr/bin/oslevel = unknown
/bin/universe = unknown
PATH: .
PATH: /home/z/tmp/ooo_picom/solver/680/unxlngi6.pro/bin
PATH: /home/z/tmp/ooo_picom/solenv/unxlngi6/bin
PATH: /home/z/tmp/ooo_picom/solenv/bin
PATH: /usr/lib/qt-3.3/bin
PATH: /usr/kerberos/bin
PATH: /usr/local/bin
PATH: /bin
PATH: /usr/bin
PATH: /home/z/bin
## ----------- ##
## Core tests. ##
## ----------- ##
configure:2641: checking for gawk
configure:2657: found /bin/gawk
configure:2667: result: gawk
configure:2679: checking for gawk
configure:2697: found /bin/gawk
configure:2709: result: /bin/gawk
configure:2726: checking for sed
configure:2744: found /bin/sed
configure:2756: result: /bin/sed
configure:2772: checking for solenv environment
configure:2776: result: default
configure:2834: checking build system type
configure:2852: result: i686-pc-linux-gnu
configure:2860: checking host system type
configure:2874: result: i686-pc-linux-gnu
configure:2882: checking target system type
configure:2896: result: i686-pc-linux-gnu
configure:3057: checking whether to enable crashdump feature
configure:3073: result: no
configure:3103: checking whether to turn warnings to errors
configure:3116: result: no
configure:3121: checking whether to do a debug build
configure:3132: result: no
configure:3137: checking whether to build with additional debug utilities
configure:3149: result: no, full product build
configure:3156: checking whether to include symbols into final build
configure:3180: result: no
configure:3185: checking whether to strip the solver or not.
configure:3207: checking whether to enable native CUPS support
configure:3211: result: yes
configure:3220: checking whether to enable fontconfig support
configure:3224: result: yes
configure:3233: checking whether to enable filters for legacy binary file formats (StarOffice 5.2)
configure:3242: result: yes
configure:3275: checking whether to use RPATH in shared libraries
configure:3282: result: yes
configure:3286: checking whether to include MySpell dictionaries
configure:3289: result: yes
configure:3300: checking which shell to use
configure:3341: result: tcsh
configure:3392: checking for gcc
configure:3418: result: gcc
configure:3662: checking for C compiler version
configure:3665: gcc --version </dev/null >&5
gcc (GCC) 4.1.2 20070925 (Red Hat 4.1.2-27)
Copyright (C) 2006 Free Software Foundation, Inc.
This is free software; see the source for copying conditions. There is NO
warranty; not even for MERCHANTABILITY or FITNESS FOR A PARTICULAR PURPOSE.
configure:3668: $? = 0
configure:3670: gcc -v </dev/null >&5
Using built-in specs.
Target: i386-redhat-linux
Configured with: ../configure --prefix=/usr --mandir=/usr/share/man --infodir=/usr/share/info --enable-shared --enable-threads=posix --enable-checking=release --with-system-zlib --enable-__cxa_atexit --disable-libunwind-exceptions --enable-languages=c,c++,objc,obj-c++,java,fortran,ada --enable-java-awt=gtk --disable-dssi --enable-plugin --with-java-home=/usr/lib/jvm/java-1.5.0-gcj-1.5.0.0/jre --enable-libgcj-multifile --enable-java-maintainer-mode --with-ecj-jar=/usr/share/java/eclipse-ecj.jar --with-cpu=generic --host=i386-redhat-linux
Thread model: posix
gcc version 4.1.2 20070925 (Red Hat 4.1.2-27)
configure:3673: $? = 0
configure:3675: gcc -V </dev/null >&5
gcc: '-V' option must have argument
configure:3678: $? = 1
configure:3701: checking for C compiler default output file name
configure:3704: gcc conftest.c >&5
configure:3707: $? = 0
configure:3753: result: a.out
configure:3758: checking whether the C compiler works
configure:3764: ./a.out
configure:3767: $? = 0
configure:3784: result: yes
configure:3791: checking whether we are cross compiling
configure:3793: result: no
configure:3796: checking for suffix of executables
configure:3798: gcc -o conftest conftest.c >&5
configure:3801: $? = 0
configure:3826: result:
configure:3832: checking for suffix of object files
configure:3853: gcc -c conftest.c >&5
configure:3856: $? = 0
configure:3878: result: o
configure:3882: checking whether we are using the GNU C compiler
configure:3906: gcc -c conftest.c >&5
configure:3912: $? = 0
configure:3916: test -z
|| test ! -s conftest.err
configure:3919: $? = 0
configure:3922: test -s conftest.o
configure:3925: $? = 0
configure:3938: result: yes
configure:3944: checking whether gcc accepts -g
configure:3965: gcc -c -g conftest.c >&5
configure:3971: $? = 0
configure:3975: test -z
|| test ! -s conftest.err
configure:3978: $? = 0
configure:3981: test -s conftest.o
configure:3984: $? = 0
configure:3995: result: yes
configure:4012: checking for gcc option to accept ANSI C
configure:4082: gcc -c -g -O2 conftest.c >&5
configure:4088: $? = 0
configure:4092: test -z
|| test ! -s conftest.err
configure:4095: $? = 0
configure:4098: test -s conftest.o
configure:4101: $? = 0
configure:4119: result: none needed
configure:4137: gcc -c -g -O2 conftest.c >&5
conftest.c:2: error: expected '=', ',', ';', 'asm' or '__attribute__' before 'me'
configure:4143: $? = 1
configure: failed program was:
| #ifndef __cplusplus
| choke me
| #endif
configure:4284: checking for special C compiler options needed for large files
configure:4383: result: no
configure:4389: checking for _FILE_OFFSET_BITS value needed for large files
configure:4420: gcc -c -g -O2 conftest.c >&5
conftest.c:15: warning: left shift count >= width of type
conftest.c:15: warning: left shift count >= width of type
conftest.c:17: error: size of array 'off_t_is_large' is negative
configure:4426: $? = 1
configure: failed program was:
| /* confdefs.h. */
|
| #define PACKAGE_NAME ""
| #define PACKAGE_TARNAME ""
| #define PACKAGE_VERSION ""
| #define PACKAGE_STRING ""
| #define PACKAGE_BUGREPORT ""
| /* end confdefs.h. */
| #include <sys/types.h>
| /* Check that off_t can represent 2**63 - 1 correctly.
| We can't simply define LARGE_OFF_T to be 9223372036854775807,
| since some C++ compilers masquerading as C compilers
| incorrectly reject 9223372036854775807. */
| #define LARGE_OFF_T (((off_t) 1 << 62) - 1 + ((off_t) 1 << 62))
| int off_t_is_large[(LARGE_OFF_T % 2147483629 == 721
| && LARGE_OFF_T % 2147483647 == 1)
| ? 1 : -1];
| int
| main ()
| {
|
| ;
| return 0;
| }
configure:4473: gcc -c -g -O2 conftest.c >&5
configure:4479: $? = 0
configure:4483: test -z
|| test ! -s conftest.err
configure:4486: $? = 0
configure:4489: test -s conftest.o
configure:4492: $? = 0
configure:4504: result: 64
configure:4514: checking for _LARGE_FILES value needed for large files
configure:4545: gcc -c -g -O2 conftest.c >&5
configure:4551: $? = 0
configure:4555: test -z
|| test ! -s conftest.err
configure:4558: $? = 0
configure:4561: test -s conftest.o
configure:4564: $? = 0
configure:4629: result: no
configure:4666: checking for tcsh
configure:4684: found /bin/tcsh
configure:4696: result: /bin/tcsh
configure:4764: checking gcc home
configure:4771: result: /usr
configure:4828: checking for gcc
configure:4854: result: gcc
configure:5098: checking for C compiler version
configure:5101: gcc --version </dev/null >&5
gcc (GCC) 4.1.2 20070925 (Red Hat 4.1.2-27)
Copyright (C) 2006 Free Software Foundation, Inc.
This is free software; see the source for copying conditions. There is NO
warranty; not even for MERCHANTABILITY or FITNESS FOR A PARTICULAR PURPOSE.
configure:5104: $? = 0
configure:5106: gcc -v </dev/null >&5
Using built-in specs.
Target: i386-redhat-linux
Configured with: ../configure --prefix=/usr --mandir=/usr/share/man --infodir=/usr/share/info --enable-shared --enable-threads=posix --enable-checking=release --with-system-zlib --enable-__cxa_atexit --disable-libunwind-exceptions --enable-languages=c,c++,objc,obj-c++,java,fortran,ada --enable-java-awt=gtk --disable-dssi --enable-plugin --with-java-home=/usr/lib/jvm/java-1.5.0-gcj-1.5.0.0/jre --enable-libgcj-multifile --enable-java-maintainer-mode --with-ecj-jar=/usr/share/java/eclipse-ecj.jar --with-cpu=generic --host=i386-redhat-linux
Thread model: posix
gcc version 4.1.2 20070925 (Red Hat 4.1.2-27)
configure:5109: $? = 0
configure:5111: gcc -V </dev/null >&5
gcc: '-V' option must have argument
configure:5114: $? = 1
configure:5117: checking whether we are using the GNU C compiler
configure:5173: result: yes
configure:5179: checking whether gcc accepts -g
configure:5230: result: yes
configure:5247: checking for gcc option to accept ANSI C
configure:5354: result: none needed
configure:5372: gcc -c -g -O2 conftest.c >&5
conftest.c:2: error: expected '=', ',', ';', 'asm' or '__attribute__' before 'me'
configure:5378: $? = 1
configure: failed program was:
| #ifndef __cplusplus
| choke me
| #endif
configure:5519: checking for gcc
configure:5537: found /usr/bin/gcc
configure:5549: result: /usr/bin/gcc
configure:5564: checking the GNU gcc compiler version
configure:5584: result: checked (gcc 4.1.2)
configure:5601: checking whether gcc supports -fvisibility=hidden
configure:5621: gcc -o conftest -g -O2 -fvisibility=hidden conftest.c >&5
configure:5627: $? = 0
configure:5631: test -z
|| test ! -s conftest.err
configure:5634: $? = 0
configure:5637: test -s conftest
configure:5640: $? = 0
configure:5652: result: yes
configure:5661: checking whether to enable pch feature
configure:5679: result: no
configure:5684: checking for GNU make
configure:5693: result: make
configure:5696: checking the GNU make version
configure:5706: result: make 3.81
configure:5932: checking for perl
configure:5962: result: /usr/bin/perl
configure:5981: checking the Perl version
configure:5990: result: checked (perl 5)
configure:5999: checking for required Perl modules
configure:6002: result: all modules found
configure:6349: checking how to run the C preprocessor
configure:6384: gcc -E conftest.c
configure:6390: $? = 0
configure:6422: gcc -E conftest.c
conftest.c:10:28: error: ac_nonexistent.h: No such file or directory
configure:6428: $? = 1
configure: failed program was:
| /* confdefs.h. */
|
| #define PACKAGE_NAME ""
| #define PACKAGE_TARNAME ""
| #define PACKAGE_VERSION ""
| #define PACKAGE_STRING ""
| #define PACKAGE_BUGREPORT ""
| #define _FILE_OFFSET_BITS 64
| /* end confdefs.h. */
| #include <ac_nonexistent.h>
configure:6467: result: gcc -E
configure:6491: gcc -E conftest.c
configure:6497: $? = 0
configure:6529: gcc -E conftest.c
conftest.c:10:28: error: ac_nonexistent.h: No such file or directory
configure:6535: $? = 1
configure: failed program was:
| /* confdefs.h. */
|
| #define PACKAGE_NAME ""
| #define PACKAGE_TARNAME ""
| #define PACKAGE_VERSION ""
| #define PACKAGE_STRING ""
| #define PACKAGE_BUGREPORT ""
| #define _FILE_OFFSET_BITS 64
| /* end confdefs.h. */
| #include <ac_nonexistent.h>
configure:6579: checking for egrep
configure:6589: result: grep -E
configure:6594: checking for ANSI C header files
configure:6619: gcc -c -g -O2 conftest.c >&5
configure:6625: $? = 0
configure:6629: test -z
|| test ! -s conftest.err
configure:6632: $? = 0
configure:6635: test -s conftest.o
configure:6638: $? = 0
configure:6727: gcc -o conftest -g -O2 conftest.c >&5
conftest.c: In function 'main':
conftest.c:27: warning: incompatible implicit declaration of built-in function 'exit'
configure:6730: $? = 0
configure:6732: ./conftest
configure:6735: $? = 0
configure:6750: result: yes
configure:6762: checking whether to enable vba feature
configure:6770: result: no
configure:6818: checking for sys/types.h
configure:6834: gcc -c -g -O2 conftest.c >&5
configure:6840: $? = 0
configure:6844: test -z
|| test ! -s conftest.err
configure:6847: $? = 0
configure:6850: test -s conftest.o
configure:6853: $? = 0
configure:6864: result: yes
configure:6818: checking for sys/stat.h
configure:6834: gcc -c -g -O2 conftest.c >&5
configure:6840: $? = 0
configure:6844: test -z
|| test ! -s conftest.err
configure:6847: $? = 0
configure:6850: test -s conftest.o
configure:6853: $? = 0
configure:6864: result: yes
configure:6818: checking for stdlib.h
configure:6834: gcc -c -g -O2 conftest.c >&5
configure:6840: $? = 0
configure:6844: test -z
|| test ! -s conftest.err
configure:6847: $? = 0
configure:6850: test -s conftest.o
configure:6853: $? = 0
configure:6864: result: yes
configure:6818: checking for string.h
configure:6834: gcc -c -g -O2 conftest.c >&5
configure:6840: $? = 0
configure:6844: test -z
|| test ! -s conftest.err
configure:6847: $? = 0
configure:6850: test -s conftest.o
configure:6853: $? = 0
configure:6864: result: yes
configure:6818: checking for memory.h
configure:6834: gcc -c -g -O2 conftest.c >&5
configure:6840: $? = 0
configure:6844: test -z
|| test ! -s conftest.err
configure:6847: $? = 0
configure:6850: test -s conftest.o
configure:6853: $? = 0
configure:6864: result: yes
configure:6818: checking for strings.h
configure:6834: gcc -c -g -O2 conftest.c >&5
configure:6840: $? = 0
configure:6844: test -z
|| test ! -s conftest.err
configure:6847: $? = 0
configure:6850: test -s conftest.o
configure:6853: $? = 0
configure:6864: result: yes
configure:6818: checking for inttypes.h
configure:6834: gcc -c -g -O2 conftest.c >&5
configure:6840: $? = 0
configure:6844: test -z
|| test ! -s conftest.err
configure:6847: $? = 0
configure:6850: test -s conftest.o
configure:6853: $? = 0
configure:6864: result: yes
configure:6818: checking for stdint.h
configure:6834: gcc -c -g -O2 conftest.c >&5
configure:6840: $? = 0
configure:6844: test -z
|| test ! -s conftest.err
configure:6847: $? = 0
configure:6850: test -s conftest.o
configure:6853: $? = 0
configure:6864: result: yes
configure:6818: checking for unistd.h
configure:6834: gcc -c -g -O2 conftest.c >&5
configure:6840: $? = 0
configure:6844: test -z
|| test ! -s conftest.err
configure:6847: $? = 0
configure:6850: test -s conftest.o
configure:6853: $? = 0
configure:6864: result: yes
configure:6886: checking cups/cups.h usability
configure:6898: gcc -c -g -O2 conftest.c >&5
configure:6904: $? = 0
configure:6908: test -z
|| test ! -s conftest.err
configure:6911: $? = 0
configure:6914: test -s conftest.o
configure:6917: $? = 0
configure:6927: result: yes
configure:6931: checking cups/cups.h presence
configure:6941: gcc -E conftest.c
configure:6947: $? = 0
configure:6967: result: yes
configure:7002: checking for cups/cups.h
configure:7009: result: yes
configure:7025: checking whether to enable pam support
configure:7028: result: yes
configure:7041: checking security/pam_appl.h usability
configure:7053: gcc -c -g -O2 conftest.c >&5
configure:7059: $? = 0
configure:7063: test -z
|| test ! -s conftest.err
configure:7066: $? = 0
configure:7069: test -s conftest.o
configure:7072: $? = 0
configure:7082: result: yes
configure:7086: checking security/pam_appl.h presence
configure:7096: gcc -E conftest.c
configure:7102: $? = 0
configure:7122: result: yes
configure:7157: checking for security/pam_appl.h
configure:7164: result: yes
configure:7177: checking whether to link to libpam
configure:7262: result: no, dynamically open it
configure:7522: checking whether to link to libcrypt
configure:7525: result: yes
configure:7529: checking for crypt in -lcrypt
configure:7559: gcc -o conftest -g -O2 conftest.c -lcrypt >&5
configure:7565: $? = 0
configure:7569: test -z
|| test ! -s conftest.err
configure:7572: $? = 0
configure:7575: test -s conftest
configure:7578: $? = 0
configure:7591: result: yes
configure:7721: checking for C++ compiler version
configure:7724: g++ --version </dev/null >&5
g++ (GCC) 4.1.2 20070925 (Red Hat 4.1.2-27)
Copyright (C) 2006 Free Software Foundation, Inc.
This is free software; see the source for copying conditions. There is NO
warranty; not even for MERCHANTABILITY or FITNESS FOR A PARTICULAR PURPOSE.
configure:7727: $? = 0
configure:7729: g++ -v </dev/null >&5
Using built-in specs.
Target: i386-redhat-linux
Configured with: ../configure --prefix=/usr --mandir=/usr/share/man --infodir=/usr/share/info --enable-shared --enable-threads=posix --enable-checking=release --with-system-zlib --enable-__cxa_atexit --disable-libunwind-exceptions --enable-languages=c,c++,objc,obj-c++,java,fortran,ada --enable-java-awt=gtk --disable-dssi --enable-plugin --with-java-home=/usr/lib/jvm/java-1.5.0-gcj-1.5.0.0/jre --enable-libgcj-multifile --enable-java-maintainer-mode --with-ecj-jar=/usr/share/java/eclipse-ecj.jar --with-cpu=generic --host=i386-redhat-linux
Thread model: posix
gcc version 4.1.2 20070925 (Red Hat 4.1.2-27)
configure:7732: $? = 0
configure:7734: g++ -V </dev/null >&5
g++: '-V' option must have argument
configure:7737: $? = 1
configure:7740: checking whether we are using the GNU C++ compiler
configure:7764: g++ -c conftest.cc >&5
configure:7770: $? = 0
configure:7774: test -z
|| test ! -s conftest.err
configure:7777: $? = 0
configure:7780: test -s conftest.o
configure:7783: $? = 0
configure:7796: result: yes
configure:7802: checking whether g++ accepts -g
configure:7823: g++ -c -g conftest.cc >&5
configure:7829: $? = 0
configure:7833: test -z
|| test ! -s conftest.err
configure:7836: $? = 0
configure:7839: test -s conftest.o
configure:7842: $? = 0
configure:7853: result: yes
configure:7895: g++ -c -g -O2 conftest.cc >&5
configure:7901: $? = 0
configure:7905: test -z
|| test ! -s conftest.err
configure:7908: $? = 0
configure:7911: test -s conftest.o
configure:7914: $? = 0
configure:7940: g++ -c -g -O2 conftest.cc >&5
conftest.cc: In function 'int main()':
conftest.cc:25: error: 'exit' was not declared in this scope
configure:7946: $? = 1
configure: failed program was:
| /* confdefs.h. */
|
| #define PACKAGE_NAME ""
| #define PACKAGE_TARNAME ""
| #define PACKAGE_VERSION ""
| #define PACKAGE_STRING ""
| #define PACKAGE_BUGREPORT ""
| #define _FILE_OFFSET_BITS 64
| #define STDC_HEADERS 1
| #define HAVE_SYS_TYPES_H 1
| #define HAVE_SYS_STAT_H 1
| #define HAVE_STDLIB_H 1
| #define HAVE_STRING_H 1
| #define HAVE_MEMORY_H 1
| #define HAVE_STRINGS_H 1
| #define HAVE_INTTYPES_H 1
| #define HAVE_STDINT_H 1
| #define HAVE_UNISTD_H 1
| #define HAVE_LIBCRYPT 1
| /* end confdefs.h. */
|
| int
| main ()
| {
| exit (42);
| ;
| return 0;
| }
configure:7895: g++ -c -g -O2 conftest.cc >&5
configure:7901: $? = 0
configure:7905: test -z
|| test ! -s conftest.err
configure:7908: $? = 0
configure:7911: test -s conftest.o
configure:7914: $? = 0
configure:7940: g++ -c -g -O2 conftest.cc >&5
configure:7946: $? = 0
configure:7950: test -z
|| test ! -s conftest.err
configure:7953: $? = 0
configure:7956: test -s conftest.o
configure:7959: $? = 0
configure:7985: checking the GNU C++ compiler version
configure:7992: result: checked (g++ 4.1.2)
configure:8067: checking for g++ include path
configure:8085: result: /usr/lib/gcc/i386-redhat-linux/4.1.2/../../../../include/c++/4.1.2
configure:8178: checking exception type
configure:8212: g++ -o conftest -g -O2 conftest.cc -lcrypt >&5
/tmp/ccLhTXlR.o: In function `main':
/home/z/tmp/ooo_picom/config_office/conftest.cc:33: undefined reference to `__sjthrow'
collect2: ld returned 1 exit status
configure:8218: $? = 1
configure: failed program was:
| /* confdefs.h. */
|
| #define PACKAGE_NAME ""
| #define PACKAGE_TARNAME ""
| #define PACKAGE_VERSION ""
| #define PACKAGE_STRING ""
| #define PACKAGE_BUGREPORT ""
| #define _FILE_OFFSET_BITS 64
| #define STDC_HEADERS 1
| #define HAVE_SYS_TYPES_H 1
| #define HAVE_SYS_STAT_H 1
| #define HAVE_STDLIB_H 1
| #define HAVE_STRING_H 1
| #define HAVE_MEMORY_H 1
| #define HAVE_STRINGS_H 1
| #define HAVE_INTTYPES_H 1
| #define HAVE_STDINT_H 1
| #define HAVE_UNISTD_H 1
| #define HAVE_LIBCRYPT 1
| #ifdef __cplusplus
| extern "C" void std::exit (int) throw (); using std::exit;
| #endif
| /* end confdefs.h. */
| #include <iostream>
|
| extern "C" void __sjthrow(void) __attribute__ ((__noreturn__));
|
|
| int
| main ()
| {
| __sjthrow()
| ;
| return 0;
| }
configure:8246: result: dwarf2
configure:8647: checking for STLport4 headers
configure:8652: result: using internal stlport.
configure:8763: checking which memory allocator to use
configure:8964: result: internal
configure:9044: checking whether to add custom build version
configure:9052: result: no
configure:9057: checking whether to build with Java support
configure:9060: result: yes
configure:9150: checking the installed JDK
configure:9178: result: checked (gcj)
configure:9503: checking for jawt lib name
configure:9521: checking jni.h usability
configure:9533: gcc -c -g -O2 -I/usr/lib/jvm/java-1.5.0-gcj/include conftest.c >&5
configure:9539: $? = 0
configure:9543: test -z
|| test ! -s conftest.err
configure:9546: $? = 0
configure:9549: test -s conftest.o
configure:9552: $? = 0
configure:9562: result: yes
configure:9566: checking jni.h presence
configure:9576: gcc -E conftest.c
configure:9582: $? = 0
configure:9602: result: yes
configure:9637: checking for jni.h
configure:9644: result: yes
configure:9657: checking for JAWT_GetAWT in -lgcjawt
configure:9687: gcc -o conftest -g -O2 -I/usr/lib/jvm/java-1.5.0-gcj/include -L/usr/lib/jvm/java-1.5.0-gcj/lib -lgcj conftest.c -lgcjawt -lcrypt >&5
/usr/bin/ld: cannot find -lgcjawt
collect2: ld returned 1 exit status
configure:9693: $? = 1
configure: failed program was:
| /* confdefs.h. */
|
| #define PACKAGE_NAME ""
| #define PACKAGE_TARNAME ""
| #define PACKAGE_VERSION ""
| #define PACKAGE_STRING ""
| #define PACKAGE_BUGREPORT ""
| #define _FILE_OFFSET_BITS 64
| #define STDC_HEADERS 1
| #define HAVE_SYS_TYPES_H 1
| #define HAVE_SYS_STAT_H 1
| #define HAVE_STDLIB_H 1
| #define HAVE_STRING_H 1
| #define HAVE_MEMORY_H 1
| #define HAVE_STRINGS_H 1
| #define HAVE_INTTYPES_H 1
| #define HAVE_STDINT_H 1
| #define HAVE_UNISTD_H 1
| #define HAVE_LIBCRYPT 1
| #ifdef __cplusplus
| extern "C" void std::exit (int) throw (); using std::exit;
| #endif
| /* end confdefs.h. */
|
| /* Override any gcc2 internal prototype to avoid an error. */
| #ifdef __cplusplus
| extern "C"
| #endif
| /* We use char because int might match the return type of a gcc2
| builtin and then its argument prototype would still apply. */
| char JAWT_GetAWT ();
| int
| main ()
| {
| JAWT_GetAWT ();
| ;
| return 0;
| }
configure:9719: result: no
configure:9802: result: -ljawt
configure:9808: checking whether to enable gcj aot compilation
configure:9872: result: no
configure:9890: checking how to run the C preprocessor
configure:10008: result: gcc -E
configure:10032: gcc -E conftest.c
configure:10038: $? = 0
configure:10070: gcc -E conftest.c
conftest.c:24:28: error: ac_nonexistent.h: No such file or directory
configure:10076: $? = 1
configure: failed program was:
| /* confdefs.h. */
|
| #define PACKAGE_NAME ""
| #define PACKAGE_TARNAME ""
| #define PACKAGE_VERSION ""
| #define PACKAGE_STRING ""
| #define PACKAGE_BUGREPORT ""
| #define _FILE_OFFSET_BITS 64
| #define STDC_HEADERS 1
| #define HAVE_SYS_TYPES_H 1
| #define HAVE_SYS_STAT_H 1
| #define HAVE_STDLIB_H 1
| #define HAVE_STRING_H 1
| #define HAVE_MEMORY_H 1
| #define HAVE_STRINGS_H 1
| #define HAVE_INTTYPES_H 1
| #define HAVE_STDINT_H 1
| #define HAVE_UNISTD_H 1
| #define HAVE_LIBCRYPT 1
| #ifdef __cplusplus
| extern "C" void std::exit (int) throw (); using std::exit;
| #endif
| /* end confdefs.h. */
| #include <ac_nonexistent.h>
configure:10126: checking how to run the C++ preprocessor
configure:10157: g++ -E conftest.cc
configure:10163: $? = 0
configure:10195: g++ -E conftest.cc
conftest.cc:24:28: error: ac_nonexistent.h: No such file or directory
configure:10201: $? = 1
configure: failed program was:
| /* confdefs.h. */
|
| #define PACKAGE_NAME ""
| #define PACKAGE_TARNAME ""
| #define PACKAGE_VERSION ""
| #define PACKAGE_STRING ""
| #define PACKAGE_BUGREPORT ""
| #define _FILE_OFFSET_BITS 64
| #define STDC_HEADERS 1
| #define HAVE_SYS_TYPES_H 1
| #define HAVE_SYS_STAT_H 1
| #define HAVE_STDLIB_H 1
| #define HAVE_STRING_H 1
| #define HAVE_MEMORY_H 1
| #define HAVE_STRINGS_H 1
| #define HAVE_INTTYPES_H 1
| #define HAVE_STDINT_H 1
| #define HAVE_UNISTD_H 1
| #define HAVE_LIBCRYPT 1
| #ifdef __cplusplus
| extern "C" void std::exit (int) throw (); using std::exit;
| #endif
| /* end confdefs.h. */
| #include <ac_nonexistent.h>
configure:10240: result: g++ -E
configure:10264: g++ -E conftest.cc
configure:10270: $? = 0
configure:10302: g++ -E conftest.cc
conftest.cc:24:28: error: ac_nonexistent.h: No such file or directory
configure:10308: $? = 1
configure: failed program was:
| /* confdefs.h. */
|
| #define PACKAGE_NAME ""
| #define PACKAGE_TARNAME ""
| #define PACKAGE_VERSION ""
| #define PACKAGE_STRING ""
| #define PACKAGE_BUGREPORT ""
| #define _FILE_OFFSET_BITS 64
| #define STDC_HEADERS 1
| #define HAVE_SYS_TYPES_H 1
| #define HAVE_SYS_STAT_H 1
| #define HAVE_STDLIB_H 1
| #define HAVE_STRING_H 1
| #define HAVE_MEMORY_H 1
| #define HAVE_STRINGS_H 1
| #define HAVE_INTTYPES_H 1
| #define HAVE_STDINT_H 1
| #define HAVE_UNISTD_H 1
| #define HAVE_LIBCRYPT 1
| #ifdef __cplusplus
| extern "C" void std::exit (int) throw (); using std::exit;
| #endif
| /* end confdefs.h. */
| #include <ac_nonexistent.h>
configure:10355: checking for dmake
configure:10373: found /home/z/tmp/ooo_picom/solenv/unxlngi6/bin/dmake
configure:10386: result: /home/z/tmp/ooo_picom/solenv/unxlngi6/bin/dmake
configure:10397: checking whether the found dmake is the right dmake
configure:10407: result: yes
configure:10409: checking the dmake version
configure:10422: result: OK, >= 4.6
configure:10439: checking whether to enable EPM for packing
configure:10442: result: yes
configure:10450: checking for epm
configure:10481: result: no
configure:10541: checking which package format to use
configure:10629: result: rpm
configure:10632: checking for rpm
configure:10653: result: /bin/rpm
configure:10816: checking whether to build the ODK
configure:10819: result: yes
configure:10822: checking for external/unowinreg/unowinreg.dll
configure:10838: WARNING: not found, will be cross-built using mingw32
configure:10899: checking for i386-mingw32-g++
configure:10926: result: i386-mingw32-g++
configure:10944: checking whether we are using the MinGW32 cross C++ compiler
configure:10951: result: yes
configure:10998: checking for i386-mingw32-strip
configure:11025: result: i386-mingw32-strip
configure:11064: checking for main in -lkernel32
configure:11088: i386-mingw32-g++ -o conftest -g -O2 -I/usr/lib/jvm/java-1.5.0-gcj/include -I/usr/lib/jvm/java-1.5.0-gcj/include conftest.cc -lkernel32 >&5
configure:11094: $? = 0
configure:11098: test -z
|| test ! -s conftest.err
configure:11101: $? = 0
configure:11104: test -s conftest
configure:11107: $? = 0
configure:11120: result: yes
configure:11133: checking for main in -ladvapi32
configure:11157: i386-mingw32-g++ -o conftest -g -O2 -I/usr/lib/jvm/java-1.5.0-gcj/include -I/usr/lib/jvm/java-1.5.0-gcj/include conftest.cc -ladvapi32 -lkernel32 >&5
configure:11163: $? = 0
configure:11167: test -z
|| test ! -s conftest.err
configure:11170: $? = 0
configure:11173: test -s conftest
configure:11176: $? = 0
configure:11189: result: yes
configure:11211: checking windows.h usability
configure:11223: i386-mingw32-g++ -c -g -O2 -I/usr/lib/jvm/java-1.5.0-gcj/include -I/usr/lib/jvm/java-1.5.0-gcj/include conftest.cc >&5
configure:11229: $? = 0
configure:11233: test -z
|| test ! -s conftest.err
configure:11236: $? = 0
configure:11239: test -s conftest.o
configure:11242: $? = 0
configure:11252: result: yes
configure:11256: checking windows.h presence
configure:11266: i386-mingw32-g++ -E -I/usr/lib/jvm/java-1.5.0-gcj/include conftest.cc
configure:11272: $? = 0
configure:11292: result: yes
configure:11327: checking for windows.h
configure:11334: result: yes
configure:11370: checking whether to build qadevOOo
configure:11373: result: yes
configure:11383: WARNING: prelinked libgcc_s.so.1, enabling --with-system-stdlibs, use --without-system-stdlibs to override
configure:11388: checking whether to provide libstdc++/libgcc_s in the installset
configure:11392: result: no
configure:11405: checking which zlib to use
configure:11631: result: internal
configure:11638: checking which jpeg to use
configure:11863: result: internal
configure:11870: checking which expat to use
configure:12101: result: internal
configure:12108: checking which freetype to use
configure:12214: result: internal
configure:12223: checking which libwpd to use
configure:12329: result: internal
configure:12420: WARNING: Internal freetype2 does not support emboldening.
configure:12446: checking which libxslt to use
configure:12599: result: internal
configure:12609: checking which libxml to use
configure:12716: result: internal
configure:12728: checking which python to use
configure:12972: result: internal
configure:12984: checking which db to use
configure:13334: result: internal
configure:13344: checking which hsqldb to use
configure:13400: result: internal
configure:13408: checking which beanshell to use
configure:13445: result: internal
configure:13453: checking which xml-apis to use
configure:13565: result: internal
configure:13573: checking which xerces to use
configure:13661: result: internal
configure:13669: checking which xalan to use
configure:13810: result: internal
configure:13825: checking which curl to use
configure:13894: result: internal
configure:13903: checking which boost to use
configure:14216: result: internal
configure:14223: checking which odbc headers to use
configure:14377: result: internal
configure:14384: checking whether to enable build of Mozilla/Mozilla NSS-using components
configure:14391: result: yes
configure:14397: checking whether to build Mozilla addressbook connectivity
configure:14403: result: no, not possible with system-mozilla
configure:14410: checking whether to build XML Security support
configure:14416: result: yes
configure:14423: checking whether to build LDAP configuration backend
configure:14436: result: no
configure:14771: checking which mozilla to use
configure:14774: result: external
configure:14777: checking which Mozilla flavour to use
configure:14787: result: Firefox
configure:14796: checking for pkg-config
configure:14814: found /usr/bin/pkg-config
configure:14827: result: /usr/bin/pkg-config
configure:14844: checking for firefox-xpcom
configure:14848: result: yes
configure:14852: checking MOZILLAXPCOM_CFLAGS
configure:14855: result: -I/usr/include/firefox-2.0.0.10 -I/usr/include/firefox-2.0.0.10/xpcom -I/usr/include/firefox-2.0.0.10/string -I/usr/include/nspr4
configure:14858: checking MOZILLAXPCOM_LIBS
configure:14861: result: -L/usr/lib/firefox-2.0.0.10 -lxpcom -lplds4 -lplc4 -lnspr4 -lpthread -ldl
configure:14944: checking for nspr
configure:14948: result: yes
configure:14952: checking MOZ_NSPR_CFLAGS
configure:14955: result: -I/usr/include/nspr4
configure:14958: checking MOZ_NSPR_LIBS
configure:14961: result: -lplds4 -lplc4 -lnspr4 -lpthread -ldl
configure:15145: checking for nss
configure:15149: result: yes
configure:15153: checking MOZ_NSS_CFLAGS
configure:15156: result: -I/usr/include/nss3 -I/usr/include/nspr4
configure:15159: checking MOZ_NSS_LIBS
configure:15162: result: -lssl3 -lsmime3 -lnss3 -lplds4 -lplc4 -lnspr4 -lpthread -ldl
configure:15297: checking for PK11_GetCertFromPrivateKey in -lnss3
configure:15327: g++ -o conftest -g -O2 -I/usr/include/nss3 -I/usr/include/nspr4 -lssl3 -lsmime3 -lnss3 -lplds4 -lplc4 -lnspr4 -lpthread -ldl conftest.cc -lnss3 -lcrypt >&5
configure:15333: $? = 0
configure:15337: test -z
|| test ! -s conftest.err
configure:15340: $? = 0
configure:15343: test -s conftest
configure:15346: $? = 0
configure:15359: result: yes
configure:16050: checking which sane header to use
configure:16203: result: internal
configure:16210: checking which icu to use
configure:16437: result: internal
configure:16469: checking for X
configure:16574: g++ -E conftest.cc
configure:16580: $? = 0
configure:16630: g++ -o conftest -g -O2 conftest.cc -lXt -lcrypt >&5
configure:16636: $? = 0
configure:16640: test -z
|| test ! -s conftest.err
configure:16643: $? = 0
configure:16646: test -s conftest
configure:16649: $? = 0
configure:16699: result: libraries , headers
configure:16871: g++ -o conftest -g -O2 conftest.cc -lcrypt -lX11 >&5
configure:16877: $? = 0
configure:16881: test -z
|| test ! -s conftest.err
configure:16884: $? = 0
configure:16887: test -s conftest
configure:16890: $? = 0
configure:17048: checking for gethostbyname
configure:17105: g++ -o conftest -g -O2 conftest.cc -lcrypt >&5
configure:17111: $? = 0
configure:17115: test -z
|| test ! -s conftest.err
configure:17118: $? = 0
configure:17121: test -s conftest
configure:17124: $? = 0
configure:17136: result: yes
configure:17287: checking for connect
configure:17344: g++ -o conftest -g -O2 conftest.cc -lcrypt >&5
configure:17350: $? = 0
configure:17354: test -z
|| test ! -s conftest.err
configure:17357: $? = 0
configure:17360: test -s conftest
configure:17363: $? = 0
configure:17375: result: yes
configure:17450: checking for remove
configure:17507: g++ -o conftest -g -O2 conftest.cc -lcrypt >&5
configure:17513: $? = 0
configure:17517: test -z
|| test ! -s conftest.err
configure:17520: $? = 0
configure:17523: test -s conftest
configure:17526: $? = 0
configure:17538: result: yes
configure:17613: checking for shmat
configure:17670: g++ -o conftest -g -O2 conftest.cc -lcrypt >&5
configure:17676: $? = 0
configure:17680: test -z
|| test ! -s conftest.err
configure:17683: $? = 0
configure:17686: test -s conftest
configure:17689: $? = 0
configure:17701: result: yes
configure:17785: checking for IceConnectionNumber in -lICE
configure:17815: g++ -o conftest -g -O2 conftest.cc -lICE -lcrypt >&5
configure:17821: $? = 0
configure:17825: test -z
|| test ! -s conftest.err
configure:17828: $? = 0
configure:17831: test -s conftest
configure:17834: $? = 0
configure:17847: result: yes
configure:17859: checking whether to use Xaw
configure:17863: result: no
configure:17869: checking for X11/Composite.h
configure:17885: g++ -c -g -O2 conftest.cc >&5
configure:17891: $? = 0
configure:17895: test -z
|| test ! -s conftest.err
configure:17898: $? = 0
configure:17901: test -s conftest.o
configure:17904: $? = 0
configure:17915: result: yes
configure:18107: checking for XOpenDisplay in -lX11
configure:18137: g++ -o conftest -g -O2 conftest.cc -lX11 -lcrypt >&5
configure:18143: $? = 0
configure:18147: test -z
|| test ! -s conftest.err
configure:18150: $? = 0
configure:18153: test -s conftest
configure:18156: $? = 0
configure:18169: result: yes
configure:18179: checking for XauDisposeAuth in -lXau
configure:18209: g++ -o conftest -g -O2 conftest.cc -lXau -lcrypt >&5
configure:18215: $? = 0
configure:18219: test -z
|| test ! -s conftest.err
configure:18222: $? = 0
configure:18225: test -s conftest
configure:18228: $? = 0
configure:18241: result: yes
configure:18283: checking fontconfig/fontconfig.h usability
configure:18295: g++ -c -g -O2 conftest.cc >&5
configure:18301: $? = 0
configure:18305: test -z
|| test ! -s conftest.err
configure:18308: $? = 0
configure:18311: test -s conftest.o
configure:18314: $? = 0
configure:18324: result: yes
configure:18328: checking fontconfig/fontconfig.h presence
configure:18338: g++ -E conftest.cc
configure:18344: $? = 0
configure:18364: result: yes
configure:18399: checking for fontconfig/fontconfig.h
configure:18406: result: yes
configure:18419: checking whether fontconfig is >= 2.2.0
configure:18444: g++ -o conftest -g -O2 conftest.cc -lcrypt >&5
configure:18447: $? = 0
configure:18449: ./conftest
configure:18452: $? = 0
configure:18454: result: yes
configure:18470: checking whether to link to Xrender
configure:18478: result: no, dynamically open it
configure:18482: checking which Xrender headers to use
configure:18635: result: internal
configure:18723: checking which nas to use
configure:18931: result: internal
configure:18941: checking for xmkmf
configure:18959: found /usr/bin/xmkmf
configure:18971: result: /usr/bin/xmkmf
configure:19044: checking whether to enable portaudio/sndfile support
configure:19049: result: yes
configure:19052: checking which sndfile to use
configure:19284: result: internal
configure:19289: checking which portaudio to use
configure:19577: result: internal
configure:19591: checking whether to build neon
configure:19599: result: yes
configure:19601: checking which neon to use
configure:19807: result: internal
configure:19820: checking whether to enable agg
configure:19826: result: yes
configure:19831: checking which AGG to use
configure:19956: result: internal
configure:19966: checking which libhunspell to use
configure:20342: result: internal
configure:20349: checking which altlinuxhyph to use
configure:20691: result: internal
configure:20697: checking which mythes to use
configure:20922: result: internal
configure:20929: checking whether libc is >= 2.1.1
configure:20932: checking for gnu_get_libc_version in -lc
configure:20962: g++ -o conftest -g -O2 conftest.cc -lc -lcrypt >&5
configure:20968: $? = 0
configure:20972: test -z
|| test ! -s conftest.err
configure:20975: $? = 0
configure:20978: test -s conftest
configure:20981: $? = 0
configure:20994: result: yes
configure:21002: result: yes
configure:21198: checking for bison
configure:21216: found /usr/bin/bison
configure:21228: result: /usr/bin/bison
configure:21240: checking the bison version
configure:21251: result: checked (/usr/bin/bison 2.3)
configure:21262: checking for flex
configure:21280: found /usr/bin/flex
configure:21292: result: /usr/bin/flex
configure:21306: checking for patch
configure:21324: found /usr/bin/patch
configure:21336: result: /usr/bin/patch
configure:21570: result: NO_ASM_HOME
configure:21585: checking for zip
configure:21603: found /usr/bin/zip
configure:21615: result: /usr/bin/zip
configure:21624: checking for unzip
configure:21642: found /usr/bin/unzip
configure:21654: result: /usr/bin/unzip
configure:21853: checking which polygon clipping code to use
configure:21888: result: internal
configure:21893: checking which VCLplugs shall be built
configure:21920: result: gtk svp
configure:21926: checking whether to enable GNOME VFS support
configure:21930: result: yes
configure:21986: checking for gnome-vfs-2.0 >= 2.6.0
configure:21990: result: yes
configure:21994: checking GNOMEVFS_CFLAGS
configure:21997: result: -pthread -DORBIT2=1 -I/usr/include/gnome-vfs-2.0 -I/usr/lib/gnome-vfs-2.0/include -I/usr/include/gconf/2 -I/usr/include/orbit-2.0 -I/usr/include/glib-2.0 -I/usr/lib/glib-2.0/include
configure:22000: checking GNOMEVFS_LIBS
configure:22003: result: -pthread -lgnomevfs-2 -lgconf-2 -lgmodule-2.0 -ldl -lORBit-2 -lgthread-2.0 -lrt -lgobject-2.0 -lglib-2.0
configure:22084: checking for gconf-2.0
configure:22088: result: yes
configure:22092: checking GCONF_CFLAGS
configure:22095: result: -DORBIT2=1 -pthread -I/usr/include/gconf/2 -I/usr/include/orbit-2.0 -I/usr/include/glib-2.0 -I/usr/lib/glib-2.0/include
configure:22098: checking GCONF_LIBS
configure:22101: result: -pthread -lgconf-2 -lORBit-2 -lgthread-2.0 -lrt -lgobject-2.0 -lglib-2.0
configure:22195: checking for gtk+-2.0 >= 2.4 gdk-pixbuf-xlib-2.0 >= 2.2
configure:22199: result: yes
configure:22203: checking GTK_CFLAGS
configure:22206: result: -I/usr/include/gtk-2.0 -I/usr/lib/gtk-2.0/include -I/usr/include/atk-1.0 -I/usr/include/cairo -I/usr/include/pango-1.0 -I/usr/include/glib-2.0 -I/usr/lib/glib-2.0/include
configure:22209: checking GTK_LIBS
configure:22212: result: -lgtk-x11-2.0 -lgdk-x11-2.0 -latk-1.0 -lpangocairo-1.0 -lpango-1.0 -lcairo -lgdk_pixbuf_xlib-2.0 -lgdk_pixbuf-2.0 -lpng12 -lm -lgobject-2.0 -lgmodule-2.0 -ldl -lglib-2.0
configure:22302: checking for glib-2.0
configure:22306: result: yes
configure:22310: checking GLIB_CFLAGS
configure:22313: result: -I/usr/include/glib-2.0 -I/usr/lib/glib-2.0/include
configure:22316: checking GLIB_LIBS
configure:22319: result: -lglib-2.0
configure:22358: checking whether to enable the Cairo canvas backend
configure:22518: result: no
configure:22701: checking whether to enable the lockdown pieces
configure:22709: result: no
configure:22714: checking whether to use libstartup-notification
configure:22820: result: no
configure:22827: checking whether to enable evolution 2 support
configure:22933: result: no
configure:22940: checking whether to enable KDE address book support
configure:23013: result: no
configure:23019: checking whether to include FontOOo
configure:23028: result: yes
configure:23042: checking whether to use system libmspack
configure:23274: result: no
configure:23281: checking whether to include MathMLDTD
configure:23289: result: yes
configure:23299: checking whether to include Bitstream Vera fonts
configure:23302: result: yes
configure:23314: checking whether to include PPDs
configure:23317: result: yes
configure:23327: checking whether to include AFMs
configure:23330: result: yes
configure:23342: checking whether and how to use Xinerama
configure:23378: result: yes, with dynamic linking
configure:23390: checking X11/extensions/Xinerama.h usability
configure:23402: g++ -c -g -O2 conftest.cc >&5
configure:23408: $? = 0
configure:23412: test -z
|| test ! -s conftest.err
configure:23415: $? = 0
configure:23418: test -s conftest.o
configure:23421: $? = 0
configure:23431: result: yes
configure:23435: checking X11/extensions/Xinerama.h presence
configure:23445: g++ -E conftest.cc
configure:23451: $? = 0
configure:23471: result: yes
configure:23506: checking for X11/extensions/Xinerama.h
configure:23513: result: yes
configure:23534: checking for XineramaIsActive in -lXinerama
configure:23564: g++ -o conftest -g -O2 conftest.cc -lXinerama -L/usr/lib -lXext -ldl -lcrypt >&5
configure:23570: $? = 0
configure:23574: test -z
|| test ! -s conftest.err
configure:23577: $? = 0
configure:23580: test -s conftest
configure:23583: $? = 0
configure:23596: result: yes
configure:23622: checking for long
configure:23646: g++ -c -g -O2 conftest.cc >&5
configure:23652: $? = 0
configure:23656: test -z
|| test ! -s conftest.err
configure:23659: $? = 0
configure:23662: test -s conftest.o
configure:23665: $? = 0
configure:23676: result: yes
configure:23679: checking size of long
configure:23998: g++ -o conftest -g -O2 conftest.cc -lXinerama -lcrypt >&5
configure:24001: $? = 0
configure:24003: ./conftest
configure:24006: $? = 0
configure:24029: result: 4
configure:24093: checking for jakarta-ant
configure:24124: result: /usr/bin/ant
configure:24152: checking if /usr/bin/ant works
configure:24177: /usr/bin/ant -buildfile conftest.xml 1>&2
Buildfile: conftest.xml
conftest:
[javac] Compiling 1 source file
BUILD SUCCESSFUL
Total time: 3 seconds
configure:24180: $? = 0
configure:24183: result: Ant works
configure:24208: checking Ant lib directory
configure:24233: result: Ant lib directory found.
configure:24239: checking which languages to be built
configure:24243: result: en-US
configure:24251: checking which languages have poor help localizations
configure:24255: result: none
configure:24263: checking which dictionaries to include
configure:24267: result: ALL
configure:24276: checking for additional 'intro' bitmaps
configure:24281: result: none
configure:24299: checking for additional 'about' bitmaps
configure:24304: result: none
configure:24323: checking for vendor
configure:24326: result: not set
configure:24336: checking for UNIX wrapper name
configure:24339: result: not set
configure:24348: checking whether to statically link to Gtk
configure:24356: result: no
configure:24374: checking solver path
configure:24378: result: default
configure:24519: creating ./config.status
## ---------------------- ##
## Running config.status. ##
## ---------------------- ##
This file was extended by config.status, which was
generated by GNU Autoconf 2.59. Invocation command line was
CONFIG_FILES =
CONFIG_HEADERS =
CONFIG_LINKS =
CONFIG_COMMANDS =
$ ./config.status
on z.localdomain
config.status:906: creating set_soenv
## ---------------- ##
## Cache variables. ##
## ---------------- ##
ac_cv_build=i686-pc-linux-gnu
ac_cv_build_alias=i686-pc-linux-gnu
ac_cv_c_compiler_gnu=yes
ac_cv_cxx_compiler_gnu=yes
ac_cv_env_CC_set=set
ac_cv_env_CC_value=gcc
ac_cv_env_CFLAGS_set=
ac_cv_env_CFLAGS_value=
ac_cv_env_CPPFLAGS_set=
ac_cv_env_CPPFLAGS_value=
ac_cv_env_CPP_set=
ac_cv_env_CPP_value=
ac_cv_env_CXXCPP_set=
ac_cv_env_CXXCPP_value=
ac_cv_env_CXXFLAGS_set=
ac_cv_env_CXXFLAGS_value=
ac_cv_env_CXX_set=set
ac_cv_env_CXX_value=g++
ac_cv_env_LDFLAGS_set=
ac_cv_env_LDFLAGS_value=
ac_cv_env_build_alias_set=
ac_cv_env_build_alias_value=
ac_cv_env_host_alias_set=
ac_cv_env_host_alias_value=
ac_cv_env_target_alias_set=
ac_cv_env_target_alias_value=
ac_cv_exeext=
ac_cv_func_connect=yes
ac_cv_func_gethostbyname=yes
ac_cv_func_remove=yes
ac_cv_func_shmat=yes
ac_cv_have_x='have_x=yes ac_x_includes= ac_x_libraries='
ac_cv_header_X11_Composite_h=yes
ac_cv_header_X11_extensions_Xinerama_h=yes
ac_cv_header_cups_cups_h=yes
ac_cv_header_fontconfig_fontconfig_h=yes
ac_cv_header_inttypes_h=yes
ac_cv_header_jni_h=yes
ac_cv_header_memory_h=yes
ac_cv_header_security_pam_appl_h=yes
ac_cv_header_stdc=yes
ac_cv_header_stdint_h=yes
ac_cv_header_stdlib_h=yes
ac_cv_header_string_h=yes
ac_cv_header_strings_h=yes
ac_cv_header_sys_stat_h=yes
ac_cv_header_sys_types_h=yes
ac_cv_header_unistd_h=yes
ac_cv_header_windows_h=yes
ac_cv_host=i686-pc-linux-gnu
ac_cv_host_alias=i686-pc-linux-gnu
ac_cv_lib_ICE_IceConnectionNumber=yes
ac_cv_lib_X11_XOpenDisplay=yes
ac_cv_lib_Xau_XauDisposeAuth=yes
ac_cv_lib_Xinerama_XineramaIsActive=yes
ac_cv_lib_advapi32=ac_cv_lib_advapi32_main
ac_cv_lib_advapi32_main=yes
ac_cv_lib_c_gnu_get_libc_version=yes
ac_cv_lib_crypt_crypt=yes
ac_cv_lib_gcjawt_JAWT_GetAWT=no
ac_cv_lib_kernel32=ac_cv_lib_kernel32_main
ac_cv_lib_kernel32_main=yes
ac_cv_lib_nss3_PK11_GetCertFromPrivateKey=yes
ac_cv_objext=o
ac_cv_path_ANT=/usr/bin/ant
ac_cv_path_AWK=/bin/gawk
ac_cv_path_BISON=/usr/bin/bison
ac_cv_path_COMPATH=/usr/bin/gcc
ac_cv_path_DMAKE=/home/z/tmp/ooo_picom/solenv/unxlngi6/bin/dmake
ac_cv_path_EPM=no
ac_cv_path_FLEX=/usr/bin/flex
ac_cv_path_PATCH=/usr/bin/patch
ac_cv_path_PERL=/usr/bin/perl
ac_cv_path_PKG_CONFIG=/usr/bin/pkg-config
ac_cv_path_SED=/bin/sed
ac_cv_path_SHELLPATH=/bin/tcsh
ac_cv_path_UNZIP=/usr/bin/unzip
ac_cv_path_XMKMF=/usr/bin/xmkmf
ac_cv_path_ZIP=/usr/bin/zip
ac_cv_prog_AWK=gawk
ac_cv_prog_CPP='gcc -E'
ac_cv_prog_CXXCPP='g++ -E'
ac_cv_prog_ac_ct_CC=gcc
ac_cv_prog_ac_ct_MINGWCXX=i386-mingw32-g++
ac_cv_prog_ac_ct_MINGWSTRIP=i386-mingw32-strip
ac_cv_prog_cc_g=yes
ac_cv_prog_cc_stdc=
ac_cv_prog_cxx_g=yes
ac_cv_prog_egrep='grep -E'
ac_cv_sizeof_long=4
ac_cv_sys_file_offset_bits=64
ac_cv_sys_large_files=no
ac_cv_sys_largefile_CC=no
ac_cv_target=i686-pc-linux-gnu
ac_cv_target_alias=i686-pc-linux-gnu
ac_cv_type_long=yes
## ----------------- ##
## Output variables. ##
## ----------------- ##
ABOUT_BITMAPS=''
AGG_CFLAGS=''
AGG_LIBS=''
AGG_VERSION='2300'
ALLOC=''
ANT='/usr/bin/ant'
ANT_HOME='/usr/share/ant'
ANT_LIB='/usr/share/java'
ASM_HOME='NO_ASM_HOME'
AWK='/bin/gawk'
AWTLIB='-ljawt'
BISON='/usr/bin/bison'
BSH_JAR=''
BUILD_DMAKE='NO'
BUILD_EPM='YES'
BUILD_MOZAB=''
BUILD_TYPE='OOo EXT BINFILTER DICTIONARIES EPM ODK QADEVOOO ZLIB JPEG EXPAT FREETYPE LIBWPD LIBXSLT LIBXML2 LIBXMLSEC PYTHON BERKELEYDB HSQLDB BSH XALAN CURL BOOST UNIXODBC SANE ICU X11_EXTENSIONS NAS SNDFILE PORTAUDIO NEON AGG GTK SYSTRAY_GTK MSFONTEXTRACT MATHMLDTD BITSTREAM_VERA_FONTS'
BUILD_UNOWINREG='YES'
BUILD_VER_STRING=''
CAIRO_CFLAGS=''
CAIRO_LIBS=''
CC='gcc'
CFLAGS=''
COMEX=''
COMPATH='/usr/bin'
CPP='gcc -E'
CPPFLAGS=' '
CRYPT_LINK='YES'
CSC_PATH=''
CURLCONFIG=''
CURL_CFLAGS=''
CURL_LIBS=''
CXX='g++'
CXXCPP='g++ -E'
CXXFLAGS='-g -O2'
CYGWIN_PATH='NO_CYGWIN'
DB_INCLUDES=''
DB_JAR=''
DB_VERSION=''
DEFS='-DPACKAGE_NAME=\"\" -DPACKAGE_TARNAME=\"\" -DPACKAGE_VERSION=\"\" -DPACKAGE_STRING=\"\" -DPACKAGE_BUGREPORT=\"\" -D_FILE_OFFSET_BITS=64 -DSTDC_HEADERS=1 -DHAVE_SYS_TYPES_H=1 -DHAVE_SYS_STAT_H=1 -DHAVE_STDLIB_H=1 -DHAVE_STRING_H=1 -DHAVE_MEMORY_H=1 -DHAVE_STRINGS_H=1 -DHAVE_INTTYPES_H=1 -DHAVE_STDINT_H=1 -DHAVE_UNISTD_H=1 -DHAVE_LIBCRYPT=1 -DHAVE_LIBKERNEL32=1 -DHAVE_LIBADVAPI32=1 -DHAVE_LIBNSS3=1 -DHAVE_X11_COMPOSITE_H=1 -DHAVE_LIBXINERAMA=1 -DSIZEOF_LONG=4 '
DIRECTXSDK_HOME=''
DIRECTXSDK_LIB=''
DISABLE_ACTIVEX=''
DISABLE_NEON=''
DISABLE_STRIP=''
DISABLE_XAW='TRUE'
DMAKE='/home/z/tmp/ooo_picom/solenv/unxlngi6/bin/dmake'
DPKG=''
ECHO_C=''
ECHO_N='-n'
ECHO_T=''
EGREP='grep -E'
ENABLE_AGG='YES'
ENABLE_CAIRO=''
ENABLE_CRASHDUMP=''
ENABLE_CUPS='TRUE'
ENABLE_DEBUG='FALSE'
ENABLE_DIRECTX=''
ENABLE_EVOAB2=''
ENABLE_FONTCONFIG='TRUE'
ENABLE_GNOMEVFS='TRUE'
ENABLE_GTK='TRUE'
ENABLE_HEADLESS='TRUE'
ENABLE_KAB=''
ENABLE_KDE=''
ENABLE_LOCKDOWN=''
ENABLE_NAS='YES'
ENABLE_PASF='YES'
ENABLE_PCH=''
ENABLE_RPATH='yes'
ENABLE_STATIC_GTK='FALSE'
ENABLE_SYMBOLS=''
ENABLE_SYSTRAY_GTK='TRUE'
ENABLE_VBA='NO'
ENABLE_WERROR='FALSE'
EPM='no'
EXCEPTIONS='dwarf2'
EXEEXT=''
FLEX='/usr/bin/flex'
FRAME_HOME=''
FREETYPE_CFLAGS=''
FREETYPE_LIBS=''
GCCVER='40102'
GCC_HOME='/usr'
GCONF_CFLAGS='-DORBIT2=1 -pthread -I/usr/include/gconf/2 -I/usr/include/orbit-2.0 -I/usr/include/glib-2.0 -I/usr/lib/glib-2.0/include '
GCONF_LIBS='-pthread -lgconf-2 -lORBit-2 -lgthread-2.0 -lrt -lgobject-2.0 -lglib-2.0 '
GLIB_CFLAGS='-I/usr/include/glib-2.0 -I/usr/lib/glib-2.0/include '
GLIB_LIBS='-lglib-2.0 '
GNOMEVFS_CFLAGS='-pthread -DORBIT2=1 -I/usr/include/gnome-vfs-2.0 -I/usr/lib/gnome-vfs-2.0/include -I/usr/include/gconf/2 -I/usr/include/orbit-2.0 -I/usr/include/glib-2.0 -I/usr/lib/glib-2.0/include '
GNOMEVFS_LIBS='-pthread -lgnomevfs-2 -lgconf-2 -lgmodule-2.0 -ldl -lORBit-2 -lgthread-2.0 -lrt -lgobject-2.0 -lglib-2.0 '
GNUCP=''
GNUMAKE='make'
GNUPATCH=''
GOBJECT_CFLAGS=''
GOBJECT_LIBS=''
GTK_CFLAGS='-I/usr/include/gtk-2.0 -I/usr/lib/gtk-2.0/include -I/usr/include/atk-1.0 -I/usr/include/cairo -I/usr/include/pango-1.0 -I/usr/include/glib-2.0 -I/usr/lib/glib-2.0/include '
GTK_LIBS='-lgtk-x11-2.0 -lgdk-x11-2.0 -latk-1.0 -lpangocairo-1.0 -lpango-1.0 -lcairo -lgdk_pixbuf_xlib-2.0 -lgdk_pixbuf-2.0 -lpng12 -lm -lgobject-2.0 -lgmodule-2.0 -ldl -lglib-2.0 '
GXX_INCLUDE_PATH='/usr/lib/gcc/i386-redhat-linux/4.1.2/../../../../include/c++/4.1.2'
HAVE_GCC_VISIBILITY_FEATURE='TRUE'
HOME='/home/z'
HSQLDB_JAR=''
HUNSPELL_CFLAGS=''
INTRO_BITMAPS=''
JAVAAOTCOMPILER=''
JAVACISGCJ=''
JAVACOMPILER='/usr/lib/jvm/java-1.5.0-gcj/bin/javac'
JAVADOC='/usr/lib/jvm/java-1.5.0-gcj/bin/javadoc'
JAVAINTERPRETER='/usr/lib/jvm/java-1.5.0-gcj/bin/java'
JAVA_HOME='/usr/lib/jvm/java-1.5.0-gcj'
JDK='gcj'
KDE_CFLAGS=''
KDE_LIBS=''
LDFLAGS=' '
LFS_CFLAGS='-D_FILE_OFFSET_BITS=64'
LIBOBJS=''
LIBS='-lXinerama -lcrypt '
LIBSN_CFLAGS=''
LIBSN_LIBS=''
LIBWPD_CFLAGS=''
LIBWPD_LIBS=''
LIBXML_CFLAGS=''
LIBXML_LIBS=''
LIBXSLT_CFLAGS=''
LIBXSLT_LIBS=''
LOCAL_SOLENV='DEFAULT'
LOCAL_SOLVER='DEFAULT'
LTLIBOBJS=''
MIDL_PATH=''
MINGWCXX='i386-mingw32-g++'
MINGWSTRIP='i386-mingw32-strip'
MINGW_LIB_INCLUDE_PATH=''
ML_EXE=''
MOC='moc'
MOZGTK2_CFLAGS=''
MOZGTK2_LIBS=''
MOZILLAXPCOM_CFLAGS='-I/usr/include/firefox-2.0.0.10 -I/usr/include/firefox-2.0.0.10/xpcom -I/usr/include/firefox-2.0.0.10/string -I/usr/include/nspr4 '
MOZILLAXPCOM_LIBS='-L/usr/lib/firefox-2.0.0.10 -lxpcom -lplds4 -lplc4 -lnspr4 -lpthread -ldl '
MOZILLA_TOOLKIT=''
MOZILLA_VERSION=''
MOZLIBREQ_CFLAGS=''
MOZLIBREQ_LIBS=''
MOZ_FLAVOUR='firefox'
MOZ_INC='/usr/include/firefox-2.0.0.10'
MOZ_LDAP_CFLAGS=''
MOZ_LIB='/usr/lib/firefox-2.0.0.10'
MOZ_LIB_XPCOM='-L/usr/lib/firefox-2.0.0.10 -lxpcom -lplds4 -lplc4 -lnspr4 -lpthread -ldl '
MOZ_NSPR_CFLAGS='-I/usr/include/nspr4 '
MOZ_NSPR_LIBS='-lplds4 -lplc4 -lnspr4 -lpthread -ldl '
MOZ_NSS_CFLAGS='-I/usr/include/nss3 -I/usr/include/nspr4 '
MOZ_NSS_LIBS='-lssl3 -lsmime3 -lnss3 -lplds4 -lplc4 -lnspr4 -lpthread -ldl '
MSPDB_PATH=''
NAS_INCLUDES=''
NEON_CFLAGS=''
NEON_LIBS='-lneon'
NEON_VERSION=''
NEW_SHADOW_API=''
NSIS_PATH=''
NSPR_LIB='-L/usr/lib'
NSS_LIB='-L/usr/lib'
OBJEXT='o'
OOO_VENDOR=''
OSVERSION=''
PACKAGE_BUGREPORT=''
PACKAGE_NAME=''
PACKAGE_STRING=''
PACKAGE_TARNAME=''
PACKAGE_VERSION=''
PAM='YES'
PAM_LINK='NO'
PATCH='/usr/bin/patch'
PATHEXTRA=''
PATH_SEPARATOR=':'
PERL='/usr/bin/perl'
PKGFORMAT='rpm'
PKGMK=''
PKG_CONFIG='/usr/bin/pkg-config'
PRODUCT='full'
PROEXT='.pro'
PROFULLSWITCH='product=full'
PSDK_HOME=''
PTHREAD_CFLAGS='-DNPTL'
PTHREAD_LIBS=''
PYTHON=''
PYTHON_CFLAGS=''
PYTHON_EXEC_PREFIX=''
PYTHON_LIBS=''
PYTHON_PLATFORM=''
PYTHON_PREFIX=''
PYTHON_VERSION=''
RPM='rpm'
SCPDEFS=''
SED='/bin/sed'
SERIALIZER_JAR=''
SHELL='/bin/sh'
SHELLPATH='/bin'
SIZEOF_LONG='4'
SOLAR_JAVA='TRUE'
SOURCEVERSION='SRC680'
STLPORT4='NO_STLPORT4'
SYSTEM_AGG='NO'
SYSTEM_BOOST='NO'
SYSTEM_BSH='NO'
SYSTEM_CAIRO=''
SYSTEM_CURL='NO'
SYSTEM_DB='NO'
SYSTEM_EXPAT='NO'
SYSTEM_FREETYPE='NO'
SYSTEM_GENBRK=''
SYSTEM_GENCCODE=''
SYSTEM_GENCMN=''
SYSTEM_HSQLDB='NO'
SYSTEM_HUNSPELL='NO'
SYSTEM_HYPH='NO'
SYSTEM_ICU='NO'
SYSTEM_JPEG='NO'
SYSTEM_LIBWPD='NO'
SYSTEM_LIBXML='NO'
SYSTEM_LIBXSLT='NO'
SYSTEM_MOZILLA='YES'
SYSTEM_MSPACK='NO'
SYSTEM_MYTHES='NO'
SYSTEM_NAS='NO'
SYSTEM_NEON='NO'
SYSTEM_ODBC_HEADERS='NO'
SYSTEM_PORTAUDIO='NO'
SYSTEM_PYTHON='NO'
SYSTEM_SANE_HEADER='NO'
SYSTEM_SNDFILE='NO'
SYSTEM_STDLIBS='YES'
SYSTEM_XALAN='NO'
SYSTEM_XERCES='NO'
SYSTEM_XML_APIS='NO'
SYSTEM_XRENDER_HEADERS='NO'
SYSTEM_ZLIB='NO'
UNIXWRAPPERNAME=''
UNZIP='/usr/bin/unzip'
UPD='680'
USE_FT_EMBOLDEN='NO'
USE_MINGW=''
USE_SHELL='tcsh'
USE_SYSTEM_STL=''
USE_XINERAMA='YES'
VBA_EXTENSION=''
VC_STANDARD=''
WITHOUT_AFMS=''
WITHOUT_PPDS=''
WITH_BINFILTER='YES'
WITH_DICT=',ALL,'
WITH_FONTOOO='YES'
WITH_FONTS='YES'
WITH_GPC='NO'
WITH_LANG=''
WITH_LDAP='NO'
WITH_LIBSN='NO'
WITH_MINGWIN='i386-mingw32-g++'
WITH_MOZILLA='YES'
WITH_MYSPELL_DICTS='YES'
WITH_OPENLDAP=''
WITH_POOR_HELP_LOCALIZATIONS=''
XALAN_JAR=''
XAU_LIBS='-lXau'
XERCES_JAR=''
XINC='/usr/include'
XINERAMA_LINK='dynamic'
XLIB='/usr/lib'
XMKMF='/usr/bin/xmkmf'
XML_APIS_JAR=''
XRENDER_LINK='NO'
XSLTPROC=''
X_CFLAGS=''
X_EXTRA_LIBS=''
X_LIBS=''
X_PRE_LIBS=' -lSM -lICE'
ZIP='/usr/bin/zip'
ZIP_HOME='/usr/bin'
_cc=''
ac_ct_CC='gcc'
ac_ct_CXX=''
ac_ct_MINGWCXX='i386-mingw32-g++'
ac_ct_MINGWSTRIP='i386-mingw32-strip'
bindir='${exec_prefix}/bin'
build='i686-pc-linux-gnu'
build_alias=''
build_cpu='i686'
build_os='linux-gnu'
build_vendor='pc'
datadir='${prefix}/share'
exec_prefix='${prefix}'
host='i686-pc-linux-gnu'
host_alias=''
host_cpu='i686'
host_os='linux-gnu'
host_vendor='pc'
includedir='${prefix}/include'
infodir='${prefix}/info'
libdir='${exec_prefix}/lib'
libexecdir='${exec_prefix}/libexec'
localstatedir='${prefix}/var'
mandir='${prefix}/man'
oldincludedir='/usr/include'
pkgpyexecdir=''
pkgpythondir=''
prefix='/usr/local'
program_transform_name='s,x,x,'
pyexecdir=''
pythondir=''
sbindir='${exec_prefix}/sbin'
sharedstatedir='${prefix}/com'
sysconfdir='${prefix}/etc'
target='i686-pc-linux-gnu'
target_alias=''
target_cpu='i686'
target_os='linux-gnu'
target_vendor='pc'
## ----------- ##
## confdefs.h. ##
## ----------- ##
#define HAVE_INTTYPES_H 1
#define HAVE_LIBADVAPI32 1
#define HAVE_LIBCRYPT 1
#define HAVE_LIBKERNEL32 1
#define HAVE_LIBNSS3 1
#define HAVE_LIBXINERAMA 1
#define HAVE_MEMORY_H 1
#define HAVE_STDINT_H 1
#define HAVE_STDLIB_H 1
#define HAVE_STRINGS_H 1
#define HAVE_STRING_H 1
#define HAVE_SYS_STAT_H 1
#define HAVE_SYS_TYPES_H 1
#define HAVE_UNISTD_H 1
#define HAVE_X11_COMPOSITE_H 1
#define PACKAGE_BUGREPORT ""
#define PACKAGE_NAME ""
#define PACKAGE_STRING ""
#define PACKAGE_TARNAME ""
#define PACKAGE_VERSION ""
#define SIZEOF_LONG 4
#define STDC_HEADERS 1
#define _FILE_OFFSET_BITS 64
#endif
#ifdef __cplusplus
extern "C" void std::exit (int) throw (); using std::exit;
configure: exit 0