GD.c: In function 'XS_GD__Font_offset':
GD.c:4259: error: syntax error before 'font'
GD.c:4265: error: 'font' undeclared (first use in this function)
GD.c:4265: error: called object 'GD__Font' is not a function
GD.c: In function 'XS_GD__Font_width':
GD.c:4286: error: syntax error before 'font'
GD.c:4292: error: 'font' undeclared (first use in this function)
GD.c:4292: error: called object 'GD__Font' is not a function
GD.c: In function 'XS_GD__Font_height':
GD.c:4313: error: syntax error before 'font'
GD.c:4319: error: 'font' undeclared (first use in this function)
GD.c:4319: error: called object 'GD__Font' is not a function
make: *** [GD.o] Error 1
/usr/bin/make -- NOT OK
Running make test
Can't test without successful make
Running make install
make had returned bad status, install seems impossible