All pastes #82381 Raw Edit

Stuff

public text v1 · immutable
·published 2006-07-08 12:21 UTC
rendered paste body
 i686-pc-linux-gnu-gcc -DHAVE_CONFIG_H -I. -I. -I../../include -I.. -I./.. -DXMBINDDIR_FALLBACK=\"/usr/lib/X11/bindings\" -DINCDIR=\"/usr/include/X11\" -DLIBDIR=\"/usr/lib/X11\" -O2 -march=i686 -pipe -fno-strict-aliasing -Wall -Wno-unused -Wno-comment -c I18List.c -MT I18List.lo -MD -MP -MF .deps/I18List.TPlo  -fPIC -DPIC -o .libs/I18List.o
I18List.c:29:28: error: X11/bitmaps/gray: No such file or directory
I18List.c: In function 'CreateGCs':
I18List.c:1935: error: 'gray_bits' undeclared (first use in this function)
I18List.c:1935: error: (Each undeclared identifier is reported only once
I18List.c:1935: error: for each function it appears in.)
I18List.c:1936: error: 'gray_width' undeclared (first use in this function)
I18List.c:1936: error: 'gray_height' undeclared (first use in this function)
make[3]: *** [I18List.lo] Error 1
make[3]: Leaving directory `/var/tmp/portage/openmotif-2.2.3-r9/work/openMotif-2.2.3/lib/Xm'
make[2]: *** [all] Error 2
make[2]: Leaving directory `/var/tmp/portage/openmotif-2.2.3-r9/work/openMotif-2.2.3/lib/Xm'
make[1]: *** [all-recursive] Error 1
make[1]: Leaving directory `/var/tmp/portage/openmotif-2.2.3-r9/work/openMotif-2.2.3/lib'
make: *** [all-recursive] Error 1

!!! ERROR: x11-libs/openmotif-2.2.3-r9 failed.
Call stack:
  ebuild.sh, line 1545:   Called dyn_compile
  ebuild.sh, line 940:   Called src_compile
  openmotif-2.2.3-r9.ebuild, line 84:   Called die

!!! make failed, if you have lesstif installed removed it, compile openmotif and recompile lesstif
!!! If you need support, post the topmost build error, and the call stack if relevant.

Knoppix linux #