All pastes #823487 Raw Edit

Someone

public text v1 · immutable
·published 2007-12-19 12:14 UTC
rendered paste body
Good - your configure finished. Start make now

Making all in doc
 cd .. && /bin/sh ./config.status doc/Makefile
config.status: creating doc/Makefile
Making all in .
Making all in en
 cd ../.. && /bin/sh ./config.status doc/en/Makefile
config.status: creating doc/en/Makefile
/usr/kde/3.5/bin/meinproc --check --cache index.cache.bz2 ./index.docbook
Making all in po
 cd .. && /bin/sh ./config.status po/Makefile
config.status: creating po/Makefile
Making all in src
Making all in icons
 cd ../.. && /bin/sh ./config.status src/icons/Makefile
config.status: creating src/icons/Makefile
Making all in klammail
Making all in klamd
 cd ../.. && /bin/sh ./config.status src/klamd/Makefile depfiles
config.status: creating src/klamd/Makefile
config.status: executing depfiles commands
scanner.c: In function ‘scanstream’:
scanner.c:399: warning: assignment makes pointer from integer without a cast
scanner.o: In function `scanstream':
scanner.c:(.text+0x1d1): undefined reference to `cli_gentempdesc'
collect2: ld returned 1 exit status
make[3]: *** [klamd] Error 1
make[2]: *** [all-recursive] Error 1
make[1]: *** [all-recursive] Error 1
make: *** [all] Error 2
 *
 * ERROR: app-antivirus/klamav-0.41 failed.
 * Call stack:
 *    ebuild.sh, line 1701:  Called dyn_compile
 *    ebuild.sh, line 1039:  Called qa_call 'src_compile'
 *    ebuild.sh, line   44:  Called src_compile
 *    ebuild.sh, line 1383:  Called kde_src_compile
 *   kde.eclass, line  170:  Called kde_src_compile 'all'
 *   kde.eclass, line  340:  Called kde_src_compile 'myconf' 'configure' 'make'
 *   kde.eclass, line  336:  Called die
 * The specific snippet of code:
 *                              emake || die "died running emake, $FUNCNAME:make"
 *  The die message:
 *   died running emake, kde_src_compile:make
 *
 * If you need support, post the topmost build error, and the call stack if relevant.
 * A complete build log is located at '/var/tmp/portage/app-antivirus/klamav-0.41/temp/build.log'.
 *

 * Messages for package app-antivirus/klamav-0.41:

 *
 * ERROR: app-antivirus/klamav-0.41 failed.
 * Call stack:
 *    ebuild.sh, line 1701:  Called dyn_compile
 *    ebuild.sh, line 1039:  Called qa_call 'src_compile'
 *    ebuild.sh, line   44:  Called src_compile
 *    ebuild.sh, line 1383:  Called kde_src_compile
 *   kde.eclass, line  170:  Called kde_src_compile 'all'
 *   kde.eclass, line  340:  Called kde_src_compile 'myconf' 'configure' 'make'
 *   kde.eclass, line  336:  Called die
 * The specific snippet of code:
 *                              emake || die "died running emake, $FUNCNAME:make"
 *  The die message:
 *   died running emake, kde_src_compile:make
 *
 * If you need support, post the topmost build error, and the call stack if relevant.
 * A complete build log is located at '/var/tmp/portage/app-antivirus/klamav-0.41/temp/build.log'.
 *