All pastes #822471 Raw Edit

Anonym

public text v1 · immutable
·published 2007-12-18 19:29 UTC
rendered paste body
In file included from /usr/lib/gcc/i486-linux-gnu/4.1.2/include/syslimits.h:7,
                 from /usr/lib/gcc/i486-linux-gnu/4.1.2/include/limits.h:11,
                 from ../common/cbasetypes.h:79,
                 from ../common/mmo.h:7,
                 from core.c:4:
/usr/lib/gcc/i486-linux-gnu/4.1.2/include/limits.h:122:61: error: limits.h: Datei oder Verzeichnis nicht gefunden
In file included from ../common/mmo.h:7,
                 from core.c:4:
../common/cbasetypes.h:281:20: error: assert.h: Datei oder Verzeichnis nicht gefunden
../common/cbasetypes.h:293:19: error: ctype.h: Datei oder Verzeichnis nicht gefunden
In file included from core.c:4:
../common/mmo.h:8:18: error: time.h: Datei oder Verzeichnis nicht gefunden
In file included from core.c:11:
../common/socket.h:15:24: error: sys/types.h: Datei oder Verzeichnis nicht gefunden
../common/socket.h:16:25: error: sys/socket.h: Datei oder Verzeichnis nicht gefunden
../common/socket.h:17:25: error: netinet/in.h: Datei oder Verzeichnis nicht gefunden
In file included from core.c:11:
../common/socket.h:79: error: expected specifier-qualifier-list before âtime_tâ
../common/socket.h:93: error: âFD_SETSIZEâ undeclared here (not in a function)
../common/socket.h:97: error: expected â=â, â,â, â;â, âasmâ or â__attribute__â before âlast_tickâ
../common/socket.h:98: error: expected â=â, â,â, â;â, âasmâ or â__attribute__â before âstall_timeâ
In file included from core.c:13:
../common/plugins.h:29:20: error: dlfcn.h: Datei oder Verzeichnis nicht gefunden
../common/plugins.h:42:31: error: string.h: Datei oder Verzeichnis nicht gefunden
core.c:19:19: error: stdio.h: Datei oder Verzeichnis nicht gefunden
core.c:20:20: error: stdlib.h: Datei oder Verzeichnis nicht gefunden
core.c:21:20: error: signal.h: Datei oder Verzeichnis nicht gefunden
core.c:24:20: error: unistd.h: Datei oder Verzeichnis nicht gefunden
core.c: In function âsig_procâ:
core.c:77: error: âSIGINTâ undeclared (first use in this function)
core.c:77: error: (Each undeclared identifier is reported only once
core.c:77: error: for each function it appears in.)
core.c:78: error: âSIGTERMâ undeclared (first use in this function)
core.c:80: warning: implicit declaration of function âexitâ
core.c:80: warning: incompatible implicit declaration of built-in function âexitâ
core.c:80: error: âEXIT_SUCCESSâ undeclared (first use in this function)
core.c:83: error: âSIGSEGVâ undeclared (first use in this function)
core.c:84: error: âSIGFPEâ undeclared (first use in this function)
core.c:87: warning: implicit declaration of function âsignalâ
core.c:87: error: âSIG_DFLâ undeclared (first use in this function)
core.c:88: warning: implicit declaration of function âraiseâ
core.c:91: error: âSIGXFSZâ undeclared (first use in this function)
core.c:96: error: âSIGPIPEâ undeclared (first use in this function)
core.c: In function âsignals_initâ:
core.c:105: error: âSIGTERMâ undeclared (first use in this function)
core.c:106: error: âSIGINTâ undeclared (first use in this function)
core.c:108: error: âSIGSEGVâ undeclared (first use in this function)
core.c:109: error: âSIGFPEâ undeclared (first use in this function)
core.c:112: error: âSIGILLâ undeclared (first use in this function)
core.c:112: error: âSIG_DFLâ undeclared (first use in this function)
core.c:113: error: âSIGXFSZâ undeclared (first use in this function)
core.c:114: error: âSIGPIPEâ undeclared (first use in this function)
core.c:115: error: âSIGBUSâ undeclared (first use in this function)
core.c:116: error: âSIGTRAPâ undeclared (first use in this function)
core.c: In function âusercheckâ:
core.c:203: warning: implicit declaration of function âgetuidâ
core.c:203: warning: implicit declaration of function âgetgidâ
core.c:206: warning: implicit declaration of function âsleepâ
core.c: In function âmainâ:
core.c:219: warning: implicit declaration of function âstrchrâ
core.c:219: warning: incompatible implicit declaration of built-in function âstrchrâ
make[2]: *** [obj/core.o] Fehler 1
make[2]: Leaving directory `/home/ragnarok/stable/src/common'
make[1]: *** [common] Fehler 2
make[1]: Leaving directory `/home/ragnarok/stable'
make: *** [sql] Fehler 2