rendered paste body[ 49%] Building CXX object workspace/kwin/effects/CMakeFiles/kwin4_effect_builtins.dir/shadow.o
/usr/bin/c++ -Dkwin4_effect_builtins_EXPORTS -Wnon-virtual-dtor -Wno-long-long -ansi -Wundef -Wcast-align -Wchar-subscripts -Wall -W -Wpointer-arith -Wformat-security -fno-exceptions -fno-check-new -fno-common -Woverloaded-virtual -fvisibility=hidden -g3 -fno-inline -fPIC -I/home/kde-devel/kde/build/KDE/kdebase/workspace/kwin/effects -I/home/kde-devel/kde/src/KDE/kdebase/workspace/kwin/effects -I/home/kde-devel/kde/src/KDE/kdebase -I/home/kde-devel/kde/build/KDE/kdebase -I/home/kde-devel/kde/build/KDE/kdebase/workspace -I/home/kde-devel/kde/src/KDE/kdebase/workspace/kdm -I/home/kde-devel/kde/src/KDE/kdebase/workspace/libs -I/home/kde-devel/kde/src/KDE/kdebase/workspace/libs/kworkspace -I/home/kde-devel/kde/build/KDE/kdebase/workspace/kwin/lib -I/home/kde-devel/kde/build/KDE/kdebase/workspace/kwin -I/home/kde-devel/kde/src/KDE/kdebase/workspace/kwin/lib -I/home/kde-devel/qt-copy/include -I/home/kde-devel/qt-copy/include/Qt -I/home/kde-devel/qt-copy/mkspecs/default -I/home/kde-devel/qt-copy/include/QtCore -I/home/kde-devel/qt-copy/include/QtGui -I/home/kde-devel/qt-copy/include/Qt3Support -I/home/kde-devel/qt-copy/include/QtAssistant -I/home/kde-devel/qt-copy/include/QtDesigner -I/home/kde-devel/qt-copy/include/QtNetwork -I/home/kde-devel/qt-copy/include/QtOpenGL -I/home/kde-devel/qt-copy/include/QtSql -I/home/kde-devel/qt-copy/include/QtXml -I/home/kde-devel/qt-copy/include/QtSvg -I/home/kde-devel/qt-copy/include/QtScript -I/home/kde-devel/qt-copy/include/QtUiTools -I/home/kde-devel/qt-copy/include/QtTest -I/home/kde-devel/qt-copy/include/QtDBus -I/home/kde-devel/kde/include -I/home/kde-devel/kde/include/KDE -D_BSD_SOURCE -D_XOPEN_SOURCE=500 -D_BSD_SOURCE -D_GNU_SOURCE -DQT_NO_STL -DQT_NO_CAST_TO_ASCII -D_REENTRANT -DKDE_DEPRECATED_WARNINGS -DHAVE_CONFIG_H=1 -o workspace/kwin/effects/CMakeFiles/kwin4_effect_builtins.dir/shadow.o -c /home/kde-devel/kde/src/KDE/kdebase/workspace/kwin/effects/shadow.cpp
/home/kde-devel/kde/src/KDE/kdebase/workspace/kwin/effects/magnifier.cpp: In member function âvirtual void KWin::MagnifierEffect::paintScreen(int, QRegion, KWin::ScreenPaintData&)â:
/home/kde-devel/kde/src/KDE/kdebase/workspace/kwin/effects/magnifier.cpp:85: error: âGL_ENABLE_BITâ was not declared in this scope
/home/kde-devel/kde/src/KDE/kdebase/workspace/kwin/effects/magnifier.cpp:85: error: âglPushAttribâ was not declared in this scope
/home/kde-devel/kde/src/KDE/kdebase/workspace/kwin/effects/magnifier.cpp:87: error: âGL_SCISSOR_TESTâ was not declared in this scope
/home/kde-devel/kde/src/KDE/kdebase/workspace/kwin/effects/magnifier.cpp:87: error: âglEnableâ was not declared in this scope
/home/kde-devel/kde/src/KDE/kdebase/workspace/kwin/effects/magnifier.cpp:90: error: âglScissorâ was not declared in this scope
/home/kde-devel/kde/src/KDE/kdebase/workspace/kwin/effects/magnifier.cpp:99: error: âglPopAttribâ was not declared in this scope
/home/kde-devel/kde/src/KDE/kdebase/workspace/kwin/effects/magnifier.cpp:100: error: âGL_CURRENT_BITâ was not declared in this scope
/home/kde-devel/kde/src/KDE/kdebase/workspace/kwin/effects/magnifier.cpp:101: error: âglColor4fâ was not declared in this scope
/home/kde-devel/kde/src/KDE/kdebase/workspace/kwin/effects/magnifier.cpp:102: error: âGL_QUADSâ was not declared in this scope
/home/kde-devel/kde/src/KDE/kdebase/workspace/kwin/effects/magnifier.cpp:102: error: âglBeginâ was not declared in this scope
/home/kde-devel/kde/src/KDE/kdebase/workspace/kwin/effects/magnifier.cpp:103: error: âglVertex2iâ was not declared in this scope
/home/kde-devel/kde/src/KDE/kdebase/workspace/kwin/effects/magnifier.cpp:119: error: âglEndâ was not declared in this scope
make[2]: *** [workspace/kwin/effects/CMakeFiles/kwin4_effect_builtins.dir/magnifier.o] Error 1
make[2]: *** Waiting for unfinished jobs....
/usr/bin/make -f workspace/plasma/applets/analog-clock/CMakeFiles/plasma_applet_clock.dir/build.make workspace/plasma/applets/analog-clock/CMakeFiles/plasma_applet_clock.dir/depend
make[2]: Entering directory `/home/kde-devel/kde/build/KDE/kdebase'
/usr/bin/cmake -E cmake_progress_report /home/kde-devel/kde/build/KDE/kdebase/CMakeFiles
[ 49%] Generating plasma_applet_clock_automoc.cpp
cd /home/kde-devel/kde/build/KDE/kdebase/workspace/plasma/applets/analog-clock && /home/kde-devel/kde/bin/kde4automoc /home/kde-devel/kde/build/KDE/kdebase/workspace/plasma/applets/analog-clock/plasma_applet_clock_automoc.cpp /home/kde-devel/kde/src/KDE/kdebase/workspace/plasma/applets/analog-clock /home/kde-devel/kde/build/KDE/kdebase/workspace/plasma/applets/analog-clock /home/kde-devel/qt-copy/bin/moc
Scanning dependencies of target plasma_applet_clock
cd /home/kde-devel/kde/build/KDE/kdebase && /usr/bin/cmake -E cmake_depends "Unix Makefiles" /home/kde-devel/kde/src/KDE/kdebase /home/kde-devel/kde/src/KDE/kdebase/workspace/plasma/applets/analog-clock /home/kde-devel/kde/build/KDE/kdebase /home/kde-devel/kde/build/KDE/kdebase/workspace/plasma/applets/analog-clock /home/kde-devel/kde/build/KDE/kdebase/workspace/plasma/applets/analog-clock/CMakeFiles/plasma_applet_clock.dir/DependInfo.cmake
make[2]: Leaving directory `/home/kde-devel/kde/build/KDE/kdebase'
/usr/bin/make -f workspace/plasma/applets/analog-clock/CMakeFiles/plasma_applet_clock.dir/build.make workspace/plasma/applets/analog-clock/CMakeFiles/plasma_applet_clock.dir/build
make[2]: Entering directory `/home/kde-devel/kde/build/KDE/kdebase'
/usr/bin/cmake -E cmake_progress_report /home/kde-devel/kde/build/KDE/kdebase/CMakeFiles
[ 49%] Building CXX object workspace/plasma/applets/analog-clock/CMakeFiles/plasma_applet_clock.dir/plasma_applet_clock_automoc.o
/usr/bin/c++ -Dplasma_applet_clock_EXPORTS -Wnon-virtual-dtor -Wno-long-long -ansi -Wundef -Wcast-align -Wchar-subscripts -Wall -W -Wpointer-arith -Wformat-security -fno-exceptions -fno-check-new -fno-common -Woverloaded-virtual -fvisibility=hidden -g3 -fno-inline -fPIC -I/home/kde-devel/kde/build/KDE/kdebase/workspace/plasma/applets/analog-clock -I/home/kde-devel/kde/src/KDE/kdebase/workspace/plasma/applets/analog-clock -I/home/kde-devel/kde/src/KDE/kdebase -I/home/kde-devel/kde/build/KDE/kdebase -I/home/kde-devel/kde/build/KDE/kdebase/workspace -I/home/kde-devel/kde/src/KDE/kdebase/workspace/kdm -I/home/kde-devel/kde/src/KDE/kdebase/workspace/libs -I/home/kde-devel/kde/src/KDE/kdebase/workspace/libs/kworkspace -I/home/kde-devel/qt-copy/include -I/home/kde-devel/qt-copy/include/Qt -I/home/kde-devel/qt-copy/mkspecs/default -I/home/kde-devel/qt-copy/include/QtCore -I/home/kde-devel/qt-copy/include/QtGui -I/home/kde-devel/qt-copy/include/Qt3Support -I/home/kde-devel/qt-copy/include/QtAssistant -I/home/kde-devel/qt-copy/include/QtDesigner -I/home/kde-devel/qt-copy/include/QtNetwork -I/home/kde-devel/qt-copy/include/QtOpenGL -I/home/kde-devel/qt-copy/include/QtSql -I/home/kde-devel/qt-copy/include/QtXml -I/home/kde-devel/qt-copy/include/QtSvg -I/home/kde-devel/qt-copy/include/QtScript -I/home/kde-devel/qt-copy/include/QtUiTools -I/home/kde-devel/qt-copy/include/QtTest -I/home/kde-devel/qt-copy/include/QtDBus -I/home/kde-devel/kde/include -I/home/kde-devel/kde/include/KDE -D_BSD_SOURCE -D_XOPEN_SOURCE=500 -D_BSD_SOURCE -D_GNU_SOURCE -DQT_NO_STL -DQT_NO_CAST_TO_ASCII -D_REENTRANT -DKDE_DEPRECATED_WARNINGS -DHAVE_CONFIG_H=1 -o workspace/plasma/applets/analog-clock/CMakeFiles/plasma_applet_clock.dir/plasma_applet_clock_automoc.o -c /home/kde-devel/kde/build/KDE/kdebase/workspace/plasma/applets/analog-clock/plasma_applet_clock_automoc.cpp
make[2]: Leaving directory `/home/kde-devel/kde/build/KDE/kdebase'
make[1]: *** [workspace/kwin/effects/CMakeFiles/kwin4_effect_builtins.dir/all] Error 2
make[1]: *** Waiting for unfinished jobs....
/usr/bin/cmake -E cmake_progress_report /home/kde-devel/kde/build/KDE/kdebase/CMakeFiles