rendered paste body[ 12%] Building CXX object soprano/soprano/CMakeFiles/soprano.dir/pluginmanager.o
/usr/bin/c++ -DMAKE_SOPRANO_LIB -Wnon-virtual-dtor -Wno-long-long -ansi -Wundef -Wcast-align -Wchar-subscripts -Wall -W -Wpointer-arith-Wformat-security -fno-check-new -fno-common -O3 -DNDEBUG -fPIC -I/dados/kde/qt-copy/include/QtCore -I/dados/kde/src/kdesupport/soprano -I/dados/kde/build/kdesupport/soprano/soprano -I/dados/kde/src/kdesupport/soprano/soprano -I/dados/kde/src/kdesupport/soprano/soprano/util -I/dados/kde/src/kdesupport/soprano/soprano/query -I/dados/kde/src/kdesupport/soprano/soprano/vocabulary -I/dados/kde/qt-copy/include -o soprano/soprano/CMakeFiles/soprano.dir/pluginmanager.o -c /dados/kde/src/kdesupport/soprano/soprano/pluginmanager.cpp
/dados/kde/src/kdesupport/soprano/soprano/pluginmanager.cpp: In function ‘QString<unnamed>::findPluginLib(const Soprano::SopranoPluginFile&)’:
/dados/kde/src/kdesupport/soprano/soprano/pluginmanager.cpp:115: error: expected `)' before ‘SOPRANO_LIB_SUFFIX’
/dados/kde/src/kdesupport/soprano/soprano/pluginmanager.cpp:116: error: expected ‘;’ before ‘SOPRANO_LIB_SUFFIX’
/dados/kde/src/kdesupport/soprano/soprano/pluginmanager.cpp:116: error: ‘SOPRANO_LIB_SUFFIX’ was not declared in this scope
/dados/kde/src/kdesupport/soprano/soprano/pluginmanager.cpp:116: error: expected `;' before string constant
make[2]: *** [soprano/soprano/CMakeFiles/soprano.dir/pluginmanager.o] Error 1
make[2]: Leaving directory `/dados/kde/build/kdesupport'
make[1]: *** [soprano/soprano/CMakeFiles/soprano.dir/all] Error 2
make[1]: Leaving directory `/dados/kde/build/kdesupport'
make: *** [all] Error 2
makeobj[0]: Leaving directory `/dados/kde/build/kdesupport'