make
g++ -c -O2 -march=i686 -msse -mfpmath=sse -fpermissive -g -ggdb3 -w -D_LINUX -DNDEBUG -Dstricmp=strcasecmp -D_stricmp=strcasecmp -D_strnicmp=strncasecmp -Dstrnicmp=strncasecmp -D_snprintf=snprintf -D_vsnprintf=vsnprintf -D_alloca=alloca -Dstrcmpi=strcasecmp -D_WCHAR_T_DEFINED -DARCH=i486 -Dstrcmpi=strcasecmp -DSOURCEUTILS_DLL -Wno-deprecated -fno-rtti -fPIC -o adplugin_i486.o -O2 -march=i686 -msse -mfpmath=sse -fpermissive -g -ggdb3 -w -D_LINUX -DNDEBUG -Dstricmp=strcasecmp -D_stricmp=strcasecmp -D_strnicmp=strncasecmp -Dstrnicmp=strncasecmp -D_snprintf=snprintf -D_vsnprintf=vsnprintf -D_alloca=alloca -Dstrcmpi=strcasecmp -D_WCHAR_T_DEFINED -DARCH=i486 -Dstrcmpi=strcasecmp -DSOURCEUTILS_DLL -Wno-deprecated -fno-rtti -fPIC -I../public/tier1 -I../public/tier0 -I../public -I../public/engine -I../public/dlls -I../public/vstdlib -I../tier1 adplugin.cpp
g++ -c -O2 -march=i686 -msse -mfpmath=sse -fpermissive -g -ggdb3 -w -D_LINUX -DNDEBUG -Dstricmp=strcasecmp -D_stricmp=strcasecmp -D_strnicmp=strncasecmp -Dstrnicmp=strncasecmp -D_snprintf=snprintf -D_vsnprintf=vsnprintf -D_alloca=alloca -Dstrcmpi=strcasecmp -D_WCHAR_T_DEFINED -DARCH=i486 -Dstrcmpi=strcasecmp -DSOURCEUTILS_DLL -Wno-deprecated -fno-rtti -fPIC -o adplugin_utils.o -O2 -march=i686 -msse -mfpmath=sse -fpermissive -g -ggdb3 -w -D_LINUX -DNDEBUG -Dstricmp=strcasecmp -D_stricmp=strcasecmp -D_strnicmp=strncasecmp -Dstrnicmp=strncasecmp -D_snprintf=snprintf -D_vsnprintf=vsnprintf -D_alloca=alloca -Dstrcmpi=strcasecmp -D_WCHAR_T_DEFINED -DARCH=i486 -Dstrcmpi=strcasecmp -DSOURCEUTILS_DLL -Wno-deprecated -fno-rtti -fPIC -I../public/tier1 -I../public/tier0 -I../public -I../public/engine -I../public/dlls -I../public/vstdlib -I../tier1 adutils.cpp
In file included from /usr/lib/gcc/i686-pc-linux-gnu/4.1.2/include/g++-v4/locale:48,
from /usr/lib/gcc/i686-pc-linux-gnu/4.1.2/include/g++-v4/bits/ostream.tcc:45,
from /usr/lib/gcc/i686-pc-linux-gnu/4.1.2/include/g++-v4/ostream:526,
from /usr/lib/gcc/i686-pc-linux-gnu/4.1.2/include/g++-v4/iostream:46,
from adplugin.h:5,
from adutils.cpp:6:
/usr/lib/gcc/i686-pc-linux-gnu/4.1.2/include/g++-v4/bits/locale_facets.tcc:563:34: error: macro "min" requires 2 arguments, but only 1 given
/usr/lib/gcc/i686-pc-linux-gnu/4.1.2/include/g++-v4/bits/locale_facets.tcc:563:67: error: macro "max" requires 2 arguments, but only 1 given
In file included from /usr/lib/gcc/i686-pc-linux-gnu/4.1.2/include/g++-v4/istream:820,
from /usr/lib/gcc/i686-pc-linux-gnu/4.1.2/include/g++-v4/iostream:47,
from adplugin.h:5,
from adutils.cpp:6:
/usr/lib/gcc/i686-pc-linux-gnu/4.1.2/include/g++-v4/bits/istream.tcc:151:36: error: macro "min" requires 2 arguments, but only 1 given
/usr/lib/gcc/i686-pc-linux-gnu/4.1.2/include/g++-v4/bits/istream.tcc:152:46: error: macro "max" requires 2 arguments, but only 1 given
/usr/lib/gcc/i686-pc-linux-gnu/4.1.2/include/g++-v4/bits/istream.tcc:204:34: error: macro "min" requires 2 arguments, but only 1 given
/usr/lib/gcc/i686-pc-linux-gnu/4.1.2/include/g++-v4/bits/istream.tcc:205:44: error: macro "max" requires 2 arguments, but only 1 given
/usr/lib/gcc/i686-pc-linux-gnu/4.1.2/include/g++-v4/bits/istream.tcc:701:48: error: macro "max" requires 2 arguments, but only 1 given
/usr/lib/gcc/i686-pc-linux-gnu/4.1.2/include/g++-v4/bits/istream.tcc:704:53: error: macro "min" requires 2 arguments, but only 1 given
/usr/lib/gcc/i686-pc-linux-gnu/4.1.2/include/g++-v4/bits/istream.tcc:712:47: error: macro "max" requires 2 arguments, but only 1 given
/usr/lib/gcc/i686-pc-linux-gnu/4.1.2/include/g++-v4/bits/istream.tcc:752:48: error: macro "max" requires 2 arguments, but only 1 given
/usr/lib/gcc/i686-pc-linux-gnu/4.1.2/include/g++-v4/bits/istream.tcc:756:53: error: macro "min" requires 2 arguments, but only 1 given
/usr/lib/gcc/i686-pc-linux-gnu/4.1.2/include/g++-v4/bits/istream.tcc:764:47: error: macro "max" requires 2 arguments, but only 1 given
/usr/lib/gcc/i686-pc-linux-gnu/4.1.2/include/g++-v4/bits/istream.tcc:770:53: error: macro "max" requires 2 arguments, but only 1 given
/usr/lib/gcc/i686-pc-linux-gnu/4.1.2/include/g++-v4/bits/istream.tcc:1068:43: error: macro "max" requires 2 arguments, but only 1 given
/usr/lib/gcc/i686-pc-linux-gnu/4.1.2/include/g++-v4/bits/stl_bvector.h: In member function 'void std::vector<bool, _Alloc>::_M_insert_range(std::_Bit_iterator, _ForwardIterator, _ForwardIterator, std::forward_iterator_tag)':
/usr/lib/gcc/i686-pc-linux-gnu/4.1.2/include/g++-v4/bits/stl_bvector.h:542: error: expected unqualified-id before '(' token
/usr/lib/gcc/i686-pc-linux-gnu/4.1.2/include/g++-v4/bits/stl_bvector.h: In member function 'void std::vector<bool, _Alloc>::_M_fill_insert(std::_Bit_iterator, size_t, bool)':
/usr/lib/gcc/i686-pc-linux-gnu/4.1.2/include/g++-v4/bits/stl_bvector.h:897: error: expected unqualified-id before '(' token
/usr/lib/gcc/i686-pc-linux-gnu/4.1.2/include/g++-v4/bits/vector.tcc: In member function 'void std::vector<_Tp, _Alloc>::_M_fill_insert(__gnu_cxx::__normal_iterator<typename std::_Vector_base<_Tp, _Alloc>::_Tp_alloc_type::pointer, std::vector<_Tp, _Alloc> >, size_t, const _Tp&)':
/usr/lib/gcc/i686-pc-linux-gnu/4.1.2/include/g++-v4/bits/vector.tcc:353: error: expected unqualified-id before '(' token
/usr/lib/gcc/i686-pc-linux-gnu/4.1.2/include/g++-v4/bits/vector.tcc: In member function 'void std::vector<_Tp, _Alloc>::_M_range_insert(__gnu_cxx::__normal_iterator<typename std::_Vector_base<_Tp, _Alloc>::_Tp_alloc_type::pointer, std::vector<_Tp, _Alloc> >, _ForwardIterator, _ForwardIterator, std::forward_iterator_tag)':
/usr/lib/gcc/i686-pc-linux-gnu/4.1.2/include/g++-v4/bits/vector.tcc:452: error: expected unqualified-id before '(' token
/usr/lib/gcc/i686-pc-linux-gnu/4.1.2/include/g++-v4/bits/basic_string.h: In member function 'int std::basic_string<_CharT, _Traits, _Alloc>::compare(const std::basic_string<_CharT, _Traits, _Alloc>&) const':
/usr/lib/gcc/i686-pc-linux-gnu/4.1.2/include/g++-v4/bits/basic_string.h:1928: error: expected unqualified-id before '(' token
/usr/lib/gcc/i686-pc-linux-gnu/4.1.2/include/g++-v4/bits/basic_string.tcc: In member function 'typename std::basic_string<_CharT, _Traits, _Alloc>::size_type std::basic_string<_CharT, _Traits, _Alloc>::rfind(const _CharT*, typename _Alloc::rebind<_CharT>::other::size_type, typename _Alloc::rebind<_CharT>::other::size_type) const':
/usr/lib/gcc/i686-pc-linux-gnu/4.1.2/include/g++-v4/bits/basic_string.tcc:761: error: expected unqualified-id before '(' token
/usr/lib/gcc/i686-pc-linux-gnu/4.1.2/include/g++-v4/bits/basic_string.tcc: In member function 'int std::basic_string<_CharT, _Traits, _Alloc>::compare(typename _Alloc::rebind<_CharT>::other::size_type, typename _Alloc::rebind<_CharT>::other::size_type, const std::basic_string<_CharT, _Traits, _Alloc>&) const':
/usr/lib/gcc/i686-pc-linux-gnu/4.1.2/include/g++-v4/bits/basic_string.tcc:898: error: expected unqualified-id before '(' token
/usr/lib/gcc/i686-pc-linux-gnu/4.1.2/include/g++-v4/bits/basic_string.tcc: In member function 'int std::basic_string<_CharT, _Traits, _Alloc>::compare(typename _Alloc::rebind<_CharT>::other::size_type, typename _Alloc::rebind<_CharT>::other::size_type, const std::basic_string<_CharT, _Traits, _Alloc>&, typename _Alloc::rebind<_CharT>::other::size_type, typename _Alloc::rebind<_CharT>::other::size_type) const':
/usr/lib/gcc/i686-pc-linux-gnu/4.1.2/include/g++-v4/bits/basic_string.tcc:915: error: expected unqualified-id before '(' token
/usr/lib/gcc/i686-pc-linux-gnu/4.1.2/include/g++-v4/bits/basic_string.tcc: In member function 'int std::basic_string<_CharT, _Traits, _Alloc>::compare(const _CharT*) const':
/usr/lib/gcc/i686-pc-linux-gnu/4.1.2/include/g++-v4/bits/basic_string.tcc:931: error: expected unqualified-id before '(' token
/usr/lib/gcc/i686-pc-linux-gnu/4.1.2/include/g++-v4/bits/basic_string.tcc: In member function 'int std::basic_string<_CharT, _Traits, _Alloc>::compare(typename _Alloc::rebind<_CharT>::other::size_type, typename _Alloc::rebind<_CharT>::other::size_type, const _CharT*) const':
/usr/lib/gcc/i686-pc-linux-gnu/4.1.2/include/g++-v4/bits/basic_string.tcc:947: error: expected unqualified-id before '(' token
/usr/lib/gcc/i686-pc-linux-gnu/4.1.2/include/g++-v4/bits/basic_string.tcc: In member function 'int std::basic_string<_CharT, _Traits, _Alloc>::compare(typename _Alloc::rebind<_CharT>::other::size_type, typename _Alloc::rebind<_CharT>::other::size_type, const _CharT*, typename _Alloc::rebind<_CharT>::other::size_type) const':
/usr/lib/gcc/i686-pc-linux-gnu/4.1.2/include/g++-v4/bits/basic_string.tcc:963: error: expected unqualified-id before '(' token
/usr/lib/gcc/i686-pc-linux-gnu/4.1.2/include/g++-v4/bits/streambuf.tcc: In member function 'virtual std::streamsize std::basic_streambuf<_CharT, _Traits>::xsgetn(_CharT*, std::streamsize)':
/usr/lib/gcc/i686-pc-linux-gnu/4.1.2/include/g++-v4/bits/streambuf.tcc:59: error: expected unqualified-id before '(' token
/usr/lib/gcc/i686-pc-linux-gnu/4.1.2/include/g++-v4/bits/streambuf.tcc: In member function 'virtual std::streamsize std::basic_streambuf<_CharT, _Traits>::xsputn(const _CharT*, std::streamsize)':
/usr/lib/gcc/i686-pc-linux-gnu/4.1.2/include/g++-v4/bits/streambuf.tcc:93: error: expected unqualified-id before '(' token
/usr/lib/gcc/i686-pc-linux-gnu/4.1.2/include/g++-v4/bits/locale_facets.tcc: In member function '_InIter std::time_get<_CharT, _InIter>::_M_extract_name(_InIter, _InIter, int&, const _CharT**, size_t, std::ios_base&, std::_Ios_Iostate&) const':
/usr/lib/gcc/i686-pc-linux-gnu/4.1.2/include/g++-v4/bits/locale_facets.tcc:2023: error: expected unqualified-id before '(' token
/usr/lib/gcc/i686-pc-linux-gnu/4.1.2/include/g++-v4/bits/locale_facets.tcc: In function 'bool std::__verify_grouping(const char*, size_t, const std::string&)':
/usr/lib/gcc/i686-pc-linux-gnu/4.1.2/include/g++-v4/bits/locale_facets.tcc:2465: error: expected unqualified-id before '(' token
/usr/lib/gcc/i686-pc-linux-gnu/4.1.2/include/g++-v4/bits/istream.tcc: In member function 'std::basic_istream<_CharT, _Traits>& std::basic_istream<_CharT, _Traits>::ignore(std::streamsize)':
/usr/lib/gcc/i686-pc-linux-gnu/4.1.2/include/g++-v4/bits/istream.tcc:701: error: ISO C++ forbids comparison between pointer and integer
/usr/lib/gcc/i686-pc-linux-gnu/4.1.2/include/g++-v4/bits/istream.tcc: In member function 'std::basic_istream<_CharT, _Traits>& std::basic_istream<_CharT, _Traits>::ignore(std::streamsize, typename _Traits::int_type)':
/usr/lib/gcc/i686-pc-linux-gnu/4.1.2/include/g++-v4/bits/istream.tcc:752: error: ISO C++ forbids comparison between pointer and integer
/usr/lib/gcc/i686-pc-linux-gnu/4.1.2/include/g++-v4/bits/istream.tcc: In member function 'std::streamsize std::basic_istream<_CharT, _Traits>::readsome(_CharT*, std::streamsize)':
/usr/lib/gcc/i686-pc-linux-gnu/4.1.2/include/g++-v4/bits/istream.tcc:847: error: expected unqualified-id before '(' token
/usr/lib/gcc/i686-pc-linux-gnu/4.1.2/include/g++-v4/bits/sstream.tcc: In member function 'virtual typename std::basic_stringbuf<_CharT, _Traits, _Alloc>::int_type std::basic_stringbuf<_CharT, _Traits, _Alloc>::overflow(typename _Traits::int_type)':
/usr/lib/gcc/i686-pc-linux-gnu/4.1.2/include/g++-v4/bits/sstream.tcc:112: error: expected unqualified-id before '(' token
/usr/lib/gcc/i686-pc-linux-gnu/4.1.2/include/g++-v4/bits/sstream.tcc:114: error: expected unqualified-id before '(' token
make: *** [adplugin_utils.o] Error 1