/home/christoph/scribus133/Version133x/Scribus/scribus/scimage.cpp: In member function ‘bool ScImage::LoadPicture(const QString&, const QString&, int, bool, bool, ScImage::RequestType, int, bool*, bool)’:
/home/christoph/scribus133/Version133x/Scribus/scribus/scimage.cpp:4388: warning: enumeration value ‘Thumbnail’ not handled in switch
/home/christoph/scribus133/Version133x/Scribus/scribus/scimage.cpp:4481: warning: enumeration value ‘Thumbnail’ not handled in switch
[ 64%] Building CXX object scribus/CMakeFiles/scribus.dir/scpainter.o
/home/christoph/scribus133/Version133x/Scribus/scribus/scpainter.cpp:39:35: error: libart_lgpl/art_vpath.h: Datei oder Verzeichnis nicht gefunden
/home/christoph/scribus133/Version133x/Scribus/scribus/scpainter.cpp:40:35: error: libart_lgpl/art_bpath.h: Datei oder Verzeichnis nicht gefunden
/home/christoph/scribus133/Version133x/Scribus/scribus/scpainter.cpp:41:41: error: libart_lgpl/art_vpath_bpath.h: Datei oder Verzeichnis nicht gefunden
/home/christoph/scribus133/Version133x/Scribus/scribus/scpainter.cpp:42:39: error: libart_lgpl/art_svp_vpath.h: Datei oder Verzeichnis nicht gefunden
/home/christoph/scribus133/Version133x/Scribus/scribus/scpainter.cpp:43:46: error: libart_lgpl/art_svp_vpath_stroke.h: Datei oder Verzeichnis nicht gefunden
/home/christoph/scribus133/Version133x/Scribus/scribus/scpainter.cpp:44:33: error: libart_lgpl/art_svp.h: Datei oder Verzeichnis nicht gefunden
/home/christoph/scribus133/Version133x/Scribus/scribus/scpainter.cpp:45:37: error: libart_lgpl/art_svp_ops.h: Datei oder Verzeichnis nicht gefunden
/home/christoph/scribus133/Version133x/Scribus/scribus/scpainter.cpp:46:36: error: libart_lgpl/art_affine.h: Datei oder Verzeichnis nicht gefunden
/home/christoph/scribus133/Version133x/Scribus/scribus/scpainter.cpp:47:43: error: libart_lgpl/art_svp_intersect.h: Datei oder Verzeichnis nicht gefunden
/home/christoph/scribus133/Version133x/Scribus/scribus/scpainter.cpp:48:38: error: libart_lgpl/art_rect_svp.h: Datei oder Verzeichnis nicht gefunden
/home/christoph/scribus133/Version133x/Scribus/scribus/scpainter.cpp:49:38: error: libart_lgpl/art_pathcode.h: Datei oder Verzeichnis nicht gefunden
/home/christoph/scribus133/Version133x/Scribus/scribus/scpainter.cpp:50:40: error: libart_lgpl/art_vpath_dash.h: Datei oder Verzeichnis nicht gefunden
/home/christoph/scribus133/Version133x/Scribus/scribus/scpainter.cpp:51:40: error: libart_lgpl/art_render_svp.h: Datei oder Verzeichnis nicht gefunden
/home/christoph/scribus133/Version133x/Scribus/scribus/scpainter.cpp:52:39: error: libart_lgpl/art_vpath_svp.h: Datei oder Verzeichnis nicht gefunden
In file included from /home/christoph/scribus133/Version133x/Scribus/scribus/scpainter.cpp:53:
/home/christoph/scribus133/Version133x/Scribus/scribus/libart/art_render_misc.h:45:41: error: libart_lgpl/art_filterlevel.h: Datei oder Verzeichnis nicht gefunden
/home/christoph/scribus133/Version133x/Scribus/scribus/libart/art_render_misc.h:46:36: error: libart_lgpl/art_render.h: Datei oder Verzeichnis nicht gefunden
In file included from /home/christoph/scribus133/Version133x/Scribus/scribus/scpainter.cpp:54:
/home/christoph/scribus133/Version133x/Scribus/scribus/libart/art_rgb_svp.h:35:40: error: libart_lgpl/art_alphagamma.h: Datei oder Verzeichnis nicht gefunden
In file included from /home/christoph/scribus133/Version133x/Scribus/scribus/scpainter.cpp:56:
/home/christoph/scribus133/Version133x/Scribus/scribus/libart/art_kmisc.h:29:34: error: libart_lgpl/art_misc.h: Datei oder Verzeichnis nicht gefunden
In file included from /home/christoph/scribus133/Version133x/Scribus/scribus/scpainter.cpp:53:
/home/christoph/scribus133/Version133x/Scribus/scribus/libart/art_render_misc.h:85: error: ISO C++ forbids declaration of ‘art_u8’ with no type
/home/christoph/scribus133/Version133x/Scribus/scribus/libart/art_render_misc.h:85: error: expected ‘;’ before ‘*’ token
/home/christoph/scribus133/Version133x/Scribus/scribus/libart/art_render_misc.h:93: error: ‘ArtPixMaxDepth’ does not name a type
/home/christoph/scribus133/Version133x/Scribus/scribus/libart/art_render_misc.h:97: error: variable or field ‘art_karbon_render_gradient_linear’ declared void
/home/christoph/scribus133/Version133x/Scribus/scribus/libart/art_render_misc.h:97: error: ‘ArtRender’ was not declared in this scope
/home/christoph/scribus133/Version133x/Scribus/scribus/libart/art_render_misc.h:97: error: ‘render’ was not declared in this scope
/home/christoph/scribus133/Version133x/Scribus/scribus/libart/art_render_misc.h:98: error: expected primary-expression before ‘const’
/home/christoph/scribus133/Version133x/Scribus/scribus/libart/art_render_misc.h:99: error: ‘ArtFilterLevel’ was not declared in this scope
/home/christoph/scribus133/Version133x/Scribus/scribus/libart/art_render_misc.h:102: error: variable or field ‘art_karbon_render_gradient_radial’ declared void
/home/christoph/scribus133/Version133x/Scribus/scribus/libart/art_render_misc.h:102: error: ‘ArtRender’ was not declared in this scope
/home/christoph/scribus133/Version133x/Scribus/scribus/libart/art_render_misc.h:102: error: ‘render’ was not declared in this scope
/home/christoph/scribus133/Version133x/Scribus/scribus/libart/art_render_misc.h:103: error: expected primary-expression before ‘const’
/home/christoph/scribus133/Version133x/Scribus/scribus/libart/art_render_misc.h:104: error: ‘ArtFilterLevel’ was not declared in this scope
/home/christoph/scribus133/Version133x/Scribus/scribus/libart/art_render_misc.h:107: error: variable or field ‘art_karbon_render_gradient_conical’ declared void
/home/christoph/scribus133/Version133x/Scribus/scribus/libart/art_render_misc.h:107: error: ‘ArtRender’ was not declared in this scope
/home/christoph/scribus133/Version133x/Scribus/scribus/libart/art_render_misc.h:107: error: ‘render’ was not declared in this scope
/home/christoph/scribus133/Version133x/Scribus/scribus/libart/art_render_misc.h:108: error: expected primary-expression before ‘const’
/home/christoph/scribus133/Version133x/Scribus/scribus/libart/art_render_misc.h:109: error: ‘ArtFilterLevel’ was not declared in this scope
In file included from /home/christoph/scribus133/Version133x/Scribus/scribus/scpainter.cpp:54:
/home/christoph/scribus133/Version133x/Scribus/scribus/libart/art_rgb_svp.h:44: error: expected ‘,’ or ‘...’ before ‘*’ token
/home/christoph/scribus133/Version133x/Scribus/scribus/libart/art_rgb_svp.h:48: error: ISO C++ forbids declaration of ‘ArtSVP’ with no type
/home/christoph/scribus133/Version133x/Scribus/scribus/libart/art_rgb_svp.h:51: error: expected ‘,’ or ‘...’ before ‘*’ token
/home/christoph/scribus133/Version133x/Scribus/scribus/libart/art_rgb_svp.h:55: error: ISO C++ forbids declaration of ‘ArtSVP’ with no type
In file included from /home/christoph/scribus133/Version133x/Scribus/scribus/scpainter.cpp:55:
/home/christoph/scribus133/Version133x/Scribus/scribus/libart/art_render_pattern.h:50: error: ‘art_u8’ does not name a type
/home/christoph/scribus133/Version133x/Scribus/scribus/libart/art_render_pattern.h:52: error: ISO C++ forbids declaration of ‘art_u8’ with no type
/home/christoph/scribus133/Version133x/Scribus/scribus/libart/art_render_pattern.h:52: error: expected ‘;’ before ‘*’ token
/home/christoph/scribus133/Version133x/Scribus/scribus/libart/art_render_pattern.h:56: error: variable or field ‘art_render_pattern’ declared void
/home/christoph/scribus133/Version133x/Scribus/scribus/libart/art_render_pattern.h:56: error: ‘ArtRender’ was not declared in this scope
/home/christoph/scribus133/Version133x/Scribus/scribus/libart/art_render_pattern.h:56: error: ‘render’ was not declared in this scope
/home/christoph/scribus133/Version133x/Scribus/scribus/libart/art_render_pattern.h:57: error: expected primary-expression before ‘const’
/home/christoph/scribus133/Version133x/Scribus/scribus/libart/art_render_pattern.h:58: error: ‘ArtFilterLevel’ was not declared in this scope
In file included from /home/christoph/scribus133/Version133x/Scribus/scribus/scpainter.cpp:56:
/home/christoph/scribus133/Version133x/Scribus/scribus/libart/art_kmisc.h:42: error: variable or field ‘ksvg_art_vpath_render_bez’ declared void
/home/christoph/scribus133/Version133x/Scribus/scribus/libart/art_kmisc.h:42: error: ‘ArtVpath’ was not declared in this scope
/home/christoph/scribus133/Version133x/Scribus/scribus/libart/art_kmisc.h:42: error: ‘p_vpath’ was not declared in this scope
/home/christoph/scribus133/Version133x/Scribus/scribus/libart/art_kmisc.h:42: error: expected primary-expression before ‘int’
/home/christoph/scribus133/Version133x/Scribus/scribus/libart/art_kmisc.h:42: error: expected primary-expression before ‘int’
/home/christoph/scribus133/Version133x/Scribus/scribus/libart/art_kmisc.h:43: error: expected primary-expression before ‘double’
/home/christoph/scribus133/Version133x/Scribus/scribus/libart/art_kmisc.h:43: error: expected primary-expression before ‘double’
/home/christoph/scribus133/Version133x/Scribus/scribus/libart/art_kmisc.h:44: error: expected primary-expression before ‘double’
/home/christoph/scribus133/Version133x/Scribus/scribus/libart/art_kmisc.h:44: error: expected primary-expression before ‘double’
/home/christoph/scribus133/Version133x/Scribus/scribus/libart/art_kmisc.h:45: error: expected primary-expression before ‘double’
/home/christoph/scribus133/Version133x/Scribus/scribus/libart/art_kmisc.h:45: error: expected primary-expression before ‘double’
/home/christoph/scribus133/Version133x/Scribus/scribus/libart/art_kmisc.h:46: error: expected primary-expression before ‘double’
/home/christoph/scribus133/Version133x/Scribus/scribus/libart/art_kmisc.h:46: error: expected primary-expression before ‘double’
/home/christoph/scribus133/Version133x/Scribus/scribus/libart/art_kmisc.h:47: error: expected primary-expression before ‘double’
/home/christoph/scribus133/Version133x/Scribus/scribus/libart/art_kmisc.h:49: error: expected constructor, destructor, or type conversion before ‘*’ token
/home/christoph/scribus133/Version133x/Scribus/scribus/libart/art_kmisc.h:55: error: variable or field ‘ksvg_art_rgb_affine’ declared void
/home/christoph/scribus133/Version133x/Scribus/scribus/libart/art_kmisc.h:55: error: ‘art_u8’ was not declared in this scope
/home/christoph/scribus133/Version133x/Scribus/scribus/libart/art_kmisc.h:55: error: ‘dst’ was not declared in this scope
/home/christoph/scribus133/Version133x/Scribus/scribus/libart/art_kmisc.h:55: error: expected primary-expression before ‘int’
/home/christoph/scribus133/Version133x/Scribus/scribus/libart/art_kmisc.h:55: error: expected primary-expression before ‘int’
/home/christoph/scribus133/Version133x/Scribus/scribus/libart/art_kmisc.h:55: error: expected primary-expression before ‘int’
/home/christoph/scribus133/Version133x/Scribus/scribus/libart/art_kmisc.h:55: error: expected primary-expression before ‘int’
/home/christoph/scribus133/Version133x/Scribus/scribus/libart/art_kmisc.h:55: error: expected primary-expression before ‘int’
/home/christoph/scribus133/Version133x/Scribus/scribus/libart/art_kmisc.h:56: error: expected primary-expression before ‘const’
/home/christoph/scribus133/Version133x/Scribus/scribus/libart/art_kmisc.h:57: error: expected primary-expression before ‘int’
/home/christoph/scribus133/Version133x/Scribus/scribus/libart/art_kmisc.h:57: error: expected primary-expression before ‘int’
/home/christoph/scribus133/Version133x/Scribus/scribus/libart/art_kmisc.h:57: error: expected primary-expression before ‘int’
/home/christoph/scribus133/Version133x/Scribus/scribus/libart/art_kmisc.h:58: error: expected primary-expression before ‘const’
/home/christoph/scribus133/Version133x/Scribus/scribus/libart/art_kmisc.h:59: error: ‘ArtFilterLevel’ was not declared in this scope
/home/christoph/scribus133/Version133x/Scribus/scribus/libart/art_kmisc.h:60: error: ‘ArtAlphaGamma’ was not declared in this scope
/home/christoph/scribus133/Version133x/Scribus/scribus/libart/art_kmisc.h:60: error: ‘alphagamma’ was not declared in this scope
/home/christoph/scribus133/Version133x/Scribus/scribus/libart/art_kmisc.h:61: error: expected primary-expression before ‘int’
/home/christoph/scribus133/Version133x/Scribus/scribus/libart/art_kmisc.h:63: error: expected ‘,’ or ‘...’ before ‘*’ token
/home/christoph/scribus133/Version133x/Scribus/scribus/libart/art_kmisc.h:67: error: ISO C++ forbids declaration of ‘ArtSVP’ with no type
/home/christoph/scribus133/Version133x/Scribus/scribus/scpainter.cpp: In destructor ‘virtual ScPainter::~ScPainter()’:
/home/christoph/scribus133/Version133x/Scribus/scribus/scpainter.cpp:187: error: ‘art_free’ was not declared in this scope
/home/christoph/scribus133/Version133x/Scribus/scribus/scpainter.cpp:189: error: ‘art_free’ was not declared in this scope
/home/christoph/scribus133/Version133x/Scribus/scribus/scpainter.cpp: In member function ‘virtual void ScPainter::end()’:
/home/christoph/scribus133/Version133x/Scribus/scribus/scpainter.cpp:223: error: ‘art_u8’ was not declared in this scope
/home/christoph/scribus133/Version133x/Scribus/scribus/scpainter.cpp:223: error: ‘p’ was not declared in this scope
/home/christoph/scribus133/Version133x/Scribus/scribus/scpainter.cpp:226: error: expected `;' before ‘r’
/home/christoph/scribus133/Version133x/Scribus/scribus/scpainter.cpp:227: error: expected `;' before ‘g’
/home/christoph/scribus133/Version133x/Scribus/scribus/scpainter.cpp:228: error: expected `;' before ‘b’
/home/christoph/scribus133/Version133x/Scribus/scribus/scpainter.cpp:229: error: expected `;' before ‘a’
/home/christoph/scribus133/Version133x/Scribus/scribus/scpainter.cpp:230: error: ‘r’ was not declared in this scope
/home/christoph/scribus133/Version133x/Scribus/scribus/scpainter.cpp:230: error: ‘g’ was not declared in this scope
/home/christoph/scribus133/Version133x/Scribus/scribus/scpainter.cpp:230: error: ‘b’ was not declared in this scope
/home/christoph/scribus133/Version133x/Scribus/scribus/scpainter.cpp:230: error: ‘a’ was not declared in this scope
/home/christoph/scribus133/Version133x/Scribus/scribus/scpainter.cpp: In member function ‘virtual void ScPainter::moveTo(const double&, const double&)’:
/home/christoph/scribus133/Version133x/Scribus/scribus/scpainter.cpp:396: error: invalid use of incomplete type ‘struct _ArtBpath’
/home/christoph/scribus133/Version133x/Scribus/scribus/scpainter.h:64: error: forward declaration of ‘struct _ArtBpath’
/home/christoph/scribus133/Version133x/Scribus/scribus/scpainter.cpp:396: error: invalid use of incomplete type ‘struct _ArtBpath’
/home/christoph/scribus133/Version133x/Scribus/scribus/scpainter.h:64: error: forward declaration of ‘struct _ArtBpath’
/home/christoph/scribus133/Version133x/Scribus/scribus/scpainter.cpp:396: error: ‘ART_MOVETO’ was not declared in this scope
/home/christoph/scribus133/Version133x/Scribus/scribus/scpainter.cpp:397: error: invalid use of incomplete type ‘struct _ArtBpath’
/home/christoph/scribus133/Version133x/Scribus/scribus/scpainter.h:64: error: forward declaration of ‘struct _ArtBpath’
/home/christoph/scribus133/Version133x/Scribus/scribus/scpainter.cpp:397: error: invalid use of incomplete type ‘struct _ArtBpath’
/home/christoph/scribus133/Version133x/Scribus/scribus/scpainter.h:64: error: forward declaration of ‘struct _ArtBpath’
/home/christoph/scribus133/Version133x/Scribus/scribus/scpainter.cpp:398: error: invalid use of incomplete type ‘struct _ArtBpath’
/home/christoph/scribus133/Version133x/Scribus/scribus/scpainter.h:64: error: forward declaration of ‘struct _ArtBpath’
/home/christoph/scribus133/Version133x/Scribus/scribus/scpainter.cpp:398: error: invalid use of incomplete type ‘struct _ArtBpath’
/home/christoph/scribus133/Version133x/Scribus/scribus/scpainter.h:64: error: forward declaration of ‘struct _ArtBpath’
/home/christoph/scribus133/Version133x/Scribus/scribus/scpainter.cpp: In member function ‘virtual void ScPainter::lineTo(const double&, const double&)’:
/home/christoph/scribus133/Version133x/Scribus/scribus/scpainter.cpp:410: error: invalid use of incomplete type ‘struct _ArtBpath’
/home/christoph/scribus133/Version133x/Scribus/scribus/scpainter.h:64: error: forward declaration of ‘struct _ArtBpath’
/home/christoph/scribus133/Version133x/Scribus/scribus/scpainter.cpp:410: error: invalid use of incomplete type ‘struct _ArtBpath’
/home/christoph/scribus133/Version133x/Scribus/scribus/scpainter.h:64: error: forward declaration of ‘struct _ArtBpath’
/home/christoph/scribus133/Version133x/Scribus/scribus/scpainter.cpp:410: error: ‘ART_LINETO’ was not declared in this scope
/home/christoph/scribus133/Version133x/Scribus/scribus/scpainter.cpp:411: error: invalid use of incomplete type ‘struct _ArtBpath’
/home/christoph/scribus133/Version133x/Scribus/scribus/scpainter.h:64: error: forward declaration of ‘struct _ArtBpath’
/home/christoph/scribus133/Version133x/Scribus/scribus/scpainter.cpp:411: error: invalid use of incomplete type ‘struct _ArtBpath’
/home/christoph/scribus133/Version133x/Scribus/scribus/scpainter.h:64: error: forward declaration of ‘struct _ArtBpath’
/home/christoph/scribus133/Version133x/Scribus/scribus/scpainter.cpp:412: error: invalid use of incomplete type ‘struct _ArtBpath’
/home/christoph/scribus133/Version133x/Scribus/scribus/scpainter.h:64: error: forward declaration of ‘struct _ArtBpath’
/home/christoph/scribus133/Version133x/Scribus/scribus/scpainter.cpp:412: error: invalid use of incomplete type ‘struct _ArtBpath’
/home/christoph/scribus133/Version133x/Scribus/scribus/scpainter.h:64: error: forward declaration of ‘struct _ArtBpath’
/home/christoph/scribus133/Version133x/Scribus/scribus/scpainter.cpp: In member function ‘virtual void ScPainter::curveTo(FPoint, FPoint, FPoint)’:
/home/christoph/scribus133/Version133x/Scribus/scribus/scpainter.cpp:429: error: invalid use of incomplete type ‘struct _ArtBpath’
/home/christoph/scribus133/Version133x/Scribus/scribus/scpainter.h:64: error: forward declaration of ‘struct _ArtBpath’
/home/christoph/scribus133/Version133x/Scribus/scribus/scpainter.cpp:429: error: invalid use of incomplete type ‘struct _ArtBpath’
/home/christoph/scribus133/Version133x/Scribus/scribus/scpainter.h:64: error: forward declaration of ‘struct _ArtBpath’
/home/christoph/scribus133/Version133x/Scribus/scribus/scpainter.cpp:429: error: ‘ART_CURVETO’ was not declared in this scope
/home/christoph/scribus133/Version133x/Scribus/scribus/scpainter.cpp:430: error: invalid use of incomplete type ‘struct _ArtBpath’
/home/christoph/scribus133/Version133x/Scribus/scribus/scpainter.h:64: error: forward declaration of ‘struct _ArtBpath’
/home/christoph/scribus133/Version133x/Scribus/scribus/scpainter.cpp:430: error: invalid use of incomplete type ‘struct _ArtBpath’
/home/christoph/scribus133/Version133x/Scribus/scribus/scpainter.h:64: error: forward declaration of ‘struct _ArtBpath’
/home/christoph/scribus133/Version133x/Scribus/scribus/scpainter.cpp:431: error: invalid use of incomplete type ‘struct _ArtBpath’
/home/christoph/scribus133/Version133x/Scribus/scribus/scpainter.h:64: error: forward declaration of ‘struct _ArtBpath’
/home/christoph/scribus133/Version133x/Scribus/scribus/scpainter.cpp:431: error: invalid use of incomplete type ‘struct _ArtBpath’
/home/christoph/scribus133/Version133x/Scribus/scribus/scpainter.h:64: error: forward declaration of ‘struct _ArtBpath’
/home/christoph/scribus133/Version133x/Scribus/scribus/scpainter.cpp:432: error: invalid use of incomplete type ‘struct _ArtBpath’
/home/christoph/scribus133/Version133x/Scribus/scribus/scpainter.h:64: error: forward declaration of ‘struct _ArtBpath’
/home/christoph/scribus133/Version133x/Scribus/scribus/scpainter.cpp:432: error: invalid use of incomplete type ‘struct _ArtBpath’
/home/christoph/scribus133/Version133x/Scribus/scribus/scpainter.h:64: error: forward declaration of ‘struct _ArtBpath’
/home/christoph/scribus133/Version133x/Scribus/scribus/scpainter.cpp:433: error: invalid use of incomplete type ‘struct _ArtBpath’
/home/christoph/scribus133/Version133x/Scribus/scribus/scpainter.h:64: error: forward declaration of ‘struct _ArtBpath’
/home/christoph/scribus133/Version133x/Scribus/scribus/scpainter.cpp:433: error: invalid use of incomplete type ‘struct _ArtBpath’
/home/christoph/scribus133/Version133x/Scribus/scribus/scpainter.h:64: error: forward declaration of ‘struct _ArtBpath’
/home/christoph/scribus133/Version133x/Scribus/scribus/scpainter.cpp:434: error: invalid use of incomplete type ‘struct _ArtBpath’
/home/christoph/scribus133/Version133x/Scribus/scribus/scpainter.h:64: error: forward declaration of ‘struct _ArtBpath’
/home/christoph/scribus133/Version133x/Scribus/scribus/scpainter.cpp:434: error: invalid use of incomplete type ‘struct _ArtBpath’
/home/christoph/scribus133/Version133x/Scribus/scribus/scpainter.h:64: error: forward declaration of ‘struct _ArtBpath’
/home/christoph/scribus133/Version133x/Scribus/scribus/scpainter.cpp:435: error: invalid use of incomplete type ‘struct _ArtBpath’
/home/christoph/scribus133/Version133x/Scribus/scribus/scpainter.h:64: error: forward declaration of ‘struct _ArtBpath’
/home/christoph/scribus133/Version133x/Scribus/scribus/scpainter.cpp:435: error: invalid use of incomplete type ‘struct _ArtBpath’
/home/christoph/scribus133/Version133x/Scribus/scribus/scpainter.h:64: error: forward declaration of ‘struct _ArtBpath’
/home/christoph/scribus133/Version133x/Scribus/scribus/scpainter.cpp: In member function ‘virtual void ScPainter::fillTextPath()’:
/home/christoph/scribus133/Version133x/Scribus/scribus/scpainter.cpp:472: error: ‘ArtVpath’ was not declared in this scope
/home/christoph/scribus133/Version133x/Scribus/scribus/scpainter.cpp:472: error: ‘path’ was not declared in this scope
/home/christoph/scribus133/Version133x/Scribus/scribus/scpainter.cpp:472: error: ‘art_bez_path_to_vec’ was not declared in this scope
/home/christoph/scribus133/Version133x/Scribus/scribus/scpainter.cpp: In member function ‘virtual void ScPainter::strokeTextPath()’:
/home/christoph/scribus133/Version133x/Scribus/scribus/scpainter.cpp:484: error: ‘ArtVpath’ was not declared in this scope
/home/christoph/scribus133/Version133x/Scribus/scribus/scpainter.cpp:484: error: ‘path’ was not declared in this scope
/home/christoph/scribus133/Version133x/Scribus/scribus/scpainter.cpp:484: error: ‘art_bez_path_to_vec’ was not declared in this scope
/home/christoph/scribus133/Version133x/Scribus/scribus/scpainter.cpp: In member function ‘virtual void ScPainter::fillPath()’:
/home/christoph/scribus133/Version133x/Scribus/scribus/scpainter.cpp:499: error: ‘ArtVpath’ was not declared in this scope
/home/christoph/scribus133/Version133x/Scribus/scribus/scpainter.cpp:499: error: ‘path’ was not declared in this scope
/home/christoph/scribus133/Version133x/Scribus/scribus/scpainter.cpp:499: error: ‘art_bez_path_to_vec’ was not declared in this scope
/home/christoph/scribus133/Version133x/Scribus/scribus/scpainter.cpp: In member function ‘virtual void ScPainter::strokePath()’:
/home/christoph/scribus133/Version133x/Scribus/scribus/scpainter.cpp:514: error: invalid use of incomplete type ‘struct _ArtBpath’
/home/christoph/scribus133/Version133x/Scribus/scribus/scpainter.h:64: error: forward declaration of ‘struct _ArtBpath’
/home/christoph/scribus133/Version133x/Scribus/scribus/scpainter.cpp:514: error: invalid use of incomplete type ‘struct _ArtBpath’
/home/christoph/scribus133/Version133x/Scribus/scribus/scpainter.h:64: error: forward declaration of ‘struct _ArtBpath’
/home/christoph/scribus133/Version133x/Scribus/scribus/scpainter.cpp:514: error: ‘ART_END’ was not declared in this scope
/home/christoph/scribus133/Version133x/Scribus/scribus/scpainter.cpp:515: error: invalid use of incomplete type ‘struct _ArtBpath’
/home/christoph/scribus133/Version133x/Scribus/scribus/scpainter.h:64: error: forward declaration of ‘struct _ArtBpath’
/home/christoph/scribus133/Version133x/Scribus/scribus/scpainter.cpp:515: error: invalid use of incomplete type ‘struct _ArtBpath’
/home/christoph/scribus133/Version133x/Scribus/scribus/scpainter.h:64: error: forward declaration of ‘struct _ArtBpath’
/home/christoph/scribus133/Version133x/Scribus/scribus/scpainter.cpp:516: error: ‘ArtVpath’ was not declared in this scope
/home/christoph/scribus133/Version133x/Scribus/scribus/scpainter.cpp:516: error: ‘path’ was not declared in this scope
/home/christoph/scribus133/Version133x/Scribus/scribus/scpainter.cpp:516: error: ‘art_bez_path_to_vec’ was not declared in this scope
/home/christoph/scribus133/Version133x/Scribus/scribus/scpainter.cpp: In member function ‘void ScPainter::drawVPath(_ArtVpath*, int, bool)’:
/home/christoph/scribus133/Version133x/Scribus/scribus/scpainter.cpp:741: error: ‘ArtSVP’ was not declared in this scope
/home/christoph/scribus133/Version133x/Scribus/scribus/scpainter.cpp:741: error: ‘strokeSvp’ was not declared in this scope
/home/christoph/scribus133/Version133x/Scribus/scribus/scpainter.cpp:742: error: ‘fillSvp’ was not declared in this scope
/home/christoph/scribus133/Version133x/Scribus/scribus/scpainter.cpp:752: error: ‘ArtVpath’ was not declared in this scope
/home/christoph/scribus133/Version133x/Scribus/scribus/scpainter.cpp:752: error: ‘temp1’ was not declared in this scope
/home/christoph/scribus133/Version133x/Scribus/scribus/scpainter.cpp:752: error: ‘art_vpath_affine_transform’ was not declared in this scope
/home/christoph/scribus133/Version133x/Scribus/scribus/scpainter.cpp:753: error: ‘art_free’ was not declared in this scope
/home/christoph/scribus133/Version133x/Scribus/scribus/scpainter.cpp:758: error: ‘art_u32’ was not declared in this scope
/home/christoph/scribus133/Version133x/Scribus/scribus/scpainter.cpp:758: error: expected `;' before ‘fillColor’
/home/christoph/scribus133/Version133x/Scribus/scribus/scpainter.cpp:767: error: ‘fillColor’ was not declared in this scope
/home/christoph/scribus133/Version133x/Scribus/scribus/scpainter.cpp:769: error: ‘ArtSvpWriter’ was not declared in this scope
/home/christoph/scribus133/Version133x/Scribus/scribus/scpainter.cpp:769: error: ‘swr’ was not declared in this scope
/home/christoph/scribus133/Version133x/Scribus/scribus/scpainter.cpp:770: error: ‘temp’ was not declared in this scope
/home/christoph/scribus133/Version133x/Scribus/scribus/scpainter.cpp:771: error: ‘art_svp_from_vpath’ was not declared in this scope
/home/christoph/scribus133/Version133x/Scribus/scribus/scpainter.cpp:773: error: ‘ART_WIND_RULE_ODDEVEN’ was not declared in this scope
/home/christoph/scribus133/Version133x/Scribus/scribus/scpainter.cpp:773: error: ‘art_svp_writer_rewind_new’ was not declared in this scope
/home/christoph/scribus133/Version133x/Scribus/scribus/scpainter.cpp:775: error: ‘ART_WIND_RULE_NONZERO’ was not declared in this scope
/home/christoph/scribus133/Version133x/Scribus/scribus/scpainter.cpp:775: error: ‘art_svp_writer_rewind_new’ was not declared in this scope
/home/christoph/scribus133/Version133x/Scribus/scribus/scpainter.cpp:776: error: ‘art_svp_intersector’ was not declared in this scope
/home/christoph/scribus133/Version133x/Scribus/scribus/scpainter.cpp:777: error: ‘art_svp_writer_rewind_reap’ was not declared in this scope
/home/christoph/scribus133/Version133x/Scribus/scribus/scpainter.cpp:778: error: ‘art_svp_free’ was not declared in this scope
/home/christoph/scribus133/Version133x/Scribus/scribus/scpainter.cpp:780: error: expected `;' before ‘strokeColor’
/home/christoph/scribus133/Version133x/Scribus/scribus/scpainter.cpp:783: error: ‘ArtPathStrokeCapType’ was not declared in this scope
/home/christoph/scribus133/Version133x/Scribus/scribus/scpainter.cpp:783: error: expected `;' before ‘capStyle’
/home/christoph/scribus133/Version133x/Scribus/scribus/scpainter.cpp:784: error: ‘ArtPathStrokeJoinType’ was not declared in this scope
/home/christoph/scribus133/Version133x/Scribus/scribus/scpainter.cpp:784: error: expected `;' before ‘joinStyle’
/home/christoph/scribus133/Version133x/Scribus/scribus/scpainter.cpp:790: error: ‘strokeColor’ was not declared in this scope
/home/christoph/scribus133/Version133x/Scribus/scribus/scpainter.cpp:795: error: ‘ArtVpathDash’ was not declared in this scope
/home/christoph/scribus133/Version133x/Scribus/scribus/scpainter.cpp:795: error: expected `;' before ‘dash’
/home/christoph/scribus133/Version133x/Scribus/scribus/scpainter.cpp:796: error: ‘dash’ was not declared in this scope
/home/christoph/scribus133/Version133x/Scribus/scribus/scpainter.cpp:804: error: ‘ArtVpath’ was not declared in this scope
/home/christoph/scribus133/Version133x/Scribus/scribus/scpainter.cpp:804: error: ‘vec2’ was not declared in this scope
/home/christoph/scribus133/Version133x/Scribus/scribus/scpainter.cpp:804: error: ‘art_vpath_dash’ was not declared in this scope
/home/christoph/scribus133/Version133x/Scribus/scribus/scpainter.cpp:805: error: ‘art_free’ was not declared in this scope
/home/christoph/scribus133/Version133x/Scribus/scribus/scpainter.cpp:810: error: ‘capStyle’ was not declared in this scope
/home/christoph/scribus133/Version133x/Scribus/scribus/scpainter.cpp:810: error: ‘ART_PATH_STROKE_CAP_ROUND’ was not declared in this scope
/home/christoph/scribus133/Version133x/Scribus/scribus/scpainter.cpp:812: error: ‘capStyle’ was not declared in this scope
/home/christoph/scribus133/Version133x/Scribus/scribus/scpainter.cpp:812: error: ‘ART_PATH_STROKE_CAP_SQUARE’ was not declared in this scope
/home/christoph/scribus133/Version133x/Scribus/scribus/scpainter.cpp:814: error: ‘joinStyle’ was not declared in this scope
/home/christoph/scribus133/Version133x/Scribus/scribus/scpainter.cpp:814: error: ‘ART_PATH_STROKE_JOIN_ROUND’ was not declared in this scope
/home/christoph/scribus133/Version133x/Scribus/scribus/scpainter.cpp:816: error: ‘joinStyle’ was not declared in this scope
/home/christoph/scribus133/Version133x/Scribus/scribus/scpainter.cpp:816: error: ‘ART_PATH_STROKE_JOIN_BEVEL’ was not declared in this scope
/home/christoph/scribus133/Version133x/Scribus/scribus/scpainter.cpp:818: error: ‘ArtVpath’ was not declared in this scope
/home/christoph/scribus133/Version133x/Scribus/scribus/scpainter.cpp:818: error: ‘strokeVpath’ was not declared in this scope
/home/christoph/scribus133/Version133x/Scribus/scribus/scpainter.cpp:818: error: ‘joinStyle’ was not declared in this scope
/home/christoph/scribus133/Version133x/Scribus/scribus/scpainter.cpp:818: error: ‘capStyle’ was not declared in this scope
/home/christoph/scribus133/Version133x/Scribus/scribus/scpainter.cpp:818: error: ‘art_svp_vpath_stroke_raw’ was not declared in this scope
/home/christoph/scribus133/Version133x/Scribus/scribus/scpainter.cpp:819: error: ‘art_svp_from_vpath’ was not declared in this scope
/home/christoph/scribus133/Version133x/Scribus/scribus/scpainter.cpp:820: error: ‘art_free’ was not declared in this scope
/home/christoph/scribus133/Version133x/Scribus/scribus/scpainter.cpp:831: error: ‘fillColor’ was not declared in this scope
/home/christoph/scribus133/Version133x/Scribus/scribus/scpainter.cpp:833: error: ‘art_svp_free’ was not declared in this scope
/home/christoph/scribus133/Version133x/Scribus/scribus/scpainter.cpp:839: error: ‘strokeColor’ was not declared in this scope
/home/christoph/scribus133/Version133x/Scribus/scribus/scpainter.cpp:840: error: ‘art_svp_free’ was not declared in this scope
/home/christoph/scribus133/Version133x/Scribus/scribus/scpainter.cpp:842: error: ‘art_free’ was not declared in this scope
/home/christoph/scribus133/Version133x/Scribus/scribus/scpainter.cpp: In member function ‘virtual void ScPainter::setClipPath()’:
/home/christoph/scribus133/Version133x/Scribus/scribus/scpainter.cpp:851: error: ‘ArtVpath’ was not declared in this scope
/home/christoph/scribus133/Version133x/Scribus/scribus/scpainter.cpp:851: error: ‘vec’ was not declared in this scope
/home/christoph/scribus133/Version133x/Scribus/scribus/scpainter.cpp:851: error: ‘art_bez_path_to_vec’ was not declared in this scope
/home/christoph/scribus133/Version133x/Scribus/scribus/scpainter.cpp:859: error: ‘temp1’ was not declared in this scope
/home/christoph/scribus133/Version133x/Scribus/scribus/scpainter.cpp:859: error: ‘art_vpath_affine_transform’ was not declared in this scope
/home/christoph/scribus133/Version133x/Scribus/scribus/scpainter.cpp:860: error: ‘art_free’ was not declared in this scope
/home/christoph/scribus133/Version133x/Scribus/scribus/scpainter.cpp:861: error: ‘ArtSvpWriter’ was not declared in this scope
/home/christoph/scribus133/Version133x/Scribus/scribus/scpainter.cpp:861: error: ‘swr’ was not declared in this scope
/home/christoph/scribus133/Version133x/Scribus/scribus/scpainter.cpp:862: error: ‘ArtSVP’ was not declared in this scope
/home/christoph/scribus133/Version133x/Scribus/scribus/scpainter.cpp:862: error: ‘temp’ was not declared in this scope
/home/christoph/scribus133/Version133x/Scribus/scribus/scpainter.cpp:862: error: ‘art_svp_from_vpath’ was not declared in this scope
/home/christoph/scribus133/Version133x/Scribus/scribus/scpainter.cpp:864: error: ‘ART_WIND_RULE_ODDEVEN’ was not declared in this scope
/home/christoph/scribus133/Version133x/Scribus/scribus/scpainter.cpp:864: error: ‘art_svp_writer_rewind_new’ was not declared in this scope
/home/christoph/scribus133/Version133x/Scribus/scribus/scpainter.cpp:866: error: ‘ART_WIND_RULE_NONZERO’ was not declared in this scope
/home/christoph/scribus133/Version133x/Scribus/scribus/scpainter.cpp:866: error: ‘art_svp_writer_rewind_new’ was not declared in this scope
/home/christoph/scribus133/Version133x/Scribus/scribus/scpainter.cpp:867: error: ‘art_svp_intersector’ was not declared in this scope
/home/christoph/scribus133/Version133x/Scribus/scribus/scpainter.cpp:868: error: ‘art_svp_writer_rewind_reap’ was not declared in this scope
/home/christoph/scribus133/Version133x/Scribus/scribus/scpainter.cpp:869: error: ‘art_svp_free’ was not declared in this scope
/home/christoph/scribus133/Version133x/Scribus/scribus/scpainter.cpp: In member function ‘virtual void ScPainter::setClipPath2(FPointArray*, bool)’:
/home/christoph/scribus133/Version133x/Scribus/scribus/scpainter.cpp:879: error: ‘ArtVpath’ was not declared in this scope
/home/christoph/scribus133/Version133x/Scribus/scribus/scpainter.cpp:879: error: ‘vec’ was not declared in this scope
/home/christoph/scribus133/Version133x/Scribus/scribus/scpainter.cpp:879: error: ‘art_bez_path_to_vec’ was not declared in this scope
/home/christoph/scribus133/Version133x/Scribus/scribus/scpainter.cpp:887: error: ‘temp1’ was not declared in this scope
/home/christoph/scribus133/Version133x/Scribus/scribus/scpainter.cpp:887: error: ‘art_vpath_affine_transform’ was not declared in this scope
/home/christoph/scribus133/Version133x/Scribus/scribus/scpainter.cpp:888: error: ‘art_free’ was not declared in this scope
/home/christoph/scribus133/Version133x/Scribus/scribus/scpainter.cpp:889: error: ‘ArtSvpWriter’ was not declared in this scope
/home/christoph/scribus133/Version133x/Scribus/scribus/scpainter.cpp:889: error: ‘swr’ was not declared in this scope
/home/christoph/scribus133/Version133x/Scribus/scribus/scpainter.cpp:890: error: ‘ArtSVP’ was not declared in this scope
/home/christoph/scribus133/Version133x/Scribus/scribus/scpainter.cpp:890: error: ‘temp’ was not declared in this scope
/home/christoph/scribus133/Version133x/Scribus/scribus/scpainter.cpp:890: error: ‘art_svp_from_vpath’ was not declared in this scope
/home/christoph/scribus133/Version133x/Scribus/scribus/scpainter.cpp:892: error: ‘ART_WIND_RULE_ODDEVEN’ was not declared in this scope
/home/christoph/scribus133/Version133x/Scribus/scribus/scpainter.cpp:892: error: ‘art_svp_writer_rewind_new’ was not declared in this scope
/home/christoph/scribus133/Version133x/Scribus/scribus/scpainter.cpp:894: error: ‘ART_WIND_RULE_NONZERO’ was not declared in this scope
/home/christoph/scribus133/Version133x/Scribus/scribus/scpainter.cpp:894: error: ‘art_svp_writer_rewind_new’ was not declared in this scope
/home/christoph/scribus133/Version133x/Scribus/scribus/scpainter.cpp:895: error: ‘art_svp_intersector’ was not declared in this scope
/home/christoph/scribus133/Version133x/Scribus/scribus/scpainter.cpp:896: error: ‘art_svp_writer_rewind_reap’ was not declared in this scope
/home/christoph/scribus133/Version133x/Scribus/scribus/scpainter.cpp:897: error: ‘temp2’ was not declared in this scope
/home/christoph/scribus133/Version133x/Scribus/scribus/scpainter.cpp:897: error: ‘art_svp_intersect’ was not declared in this scope
/home/christoph/scribus133/Version133x/Scribus/scribus/scpainter.cpp:899: error: ‘art_svp_free’ was not declared in this scope
/home/christoph/scribus133/Version133x/Scribus/scribus/scpainter.cpp: In member function ‘virtual void ScPainter::drawImage(QImage*)’:
/home/christoph/scribus133/Version133x/Scribus/scribus/scpainter.cpp:924: error: invalid conversion from ‘_ArtSVP*’ to ‘int’
/home/christoph/scribus133/Version133x/Scribus/scribus/libart/art_kmisc.h:67: error: too many arguments to function ‘void ksvg_art_rgb_affine_clip(int)’
/home/christoph/scribus133/Version133x/Scribus/scribus/scpainter.cpp:924: error: at this point in file
/home/christoph/scribus133/Version133x/Scribus/scribus/scpainter.cpp:925: error: ‘art_svp_free’ was not declared in this scope
/home/christoph/scribus133/Version133x/Scribus/scribus/scpainter.cpp: In member function ‘virtual void ScPainter::setupPolygon(FPointArray*, bool)’:
/home/christoph/scribus133/Version133x/Scribus/scribus/scpainter.cpp:979: error: invalid use of incomplete type ‘struct _ArtBpath’
/home/christoph/scribus133/Version133x/Scribus/scribus/scpainter.h:64: error: forward declaration of ‘struct _ArtBpath’
/home/christoph/scribus133/Version133x/Scribus/scribus/scpainter.cpp:979: error: invalid use of incomplete type ‘struct _ArtBpath’
/home/christoph/scribus133/Version133x/Scribus/scribus/scpainter.h:64: error: forward declaration of ‘struct _ArtBpath’
/home/christoph/scribus133/Version133x/Scribus/scribus/scpainter.cpp:979: error: ‘ART_END’ was not declared in this scope
/home/christoph/scribus133/Version133x/Scribus/scribus/scpainter.cpp:987: error: invalid use of incomplete type ‘struct _ArtBpath’
/home/christoph/scribus133/Version133x/Scribus/scribus/scpainter.h:64: error: forward declaration of ‘struct _ArtBpath’
/home/christoph/scribus133/Version133x/Scribus/scribus/scpainter.cpp:987: error: invalid use of incomplete type ‘struct _ArtBpath’
/home/christoph/scribus133/Version133x/Scribus/scribus/scpainter.h:64: error: forward declaration of ‘struct _ArtBpath’
/home/christoph/scribus133/Version133x/Scribus/scribus/scpainter.cpp:987: error: ‘ART_MOVETO’ was not declared in this scope
/home/christoph/scribus133/Version133x/Scribus/scribus/scpainter.cpp:989: error: invalid use of incomplete type ‘struct _ArtBpath’
/home/christoph/scribus133/Version133x/Scribus/scribus/scpainter.h:64: error: forward declaration of ‘struct _ArtBpath’
/home/christoph/scribus133/Version133x/Scribus/scribus/scpainter.cpp:989: error: invalid use of incomplete type ‘struct _ArtBpath’
/home/christoph/scribus133/Version133x/Scribus/scribus/scpainter.h:64: error: forward declaration of ‘struct _ArtBpath’
/home/christoph/scribus133/Version133x/Scribus/scribus/scpainter.cpp:989: error: ‘ART_MOVETO_OPEN’ was not declared in this scope
/home/christoph/scribus133/Version133x/Scribus/scribus/scpainter.cpp:990: error: invalid use of incomplete type ‘struct _ArtBpath’
/home/christoph/scribus133/Version133x/Scribus/scribus/scpainter.h:64: error: forward declaration of ‘struct _ArtBpath’
/home/christoph/scribus133/Version133x/Scribus/scribus/scpainter.cpp:990: error: invalid use of incomplete type ‘struct _ArtBpath’
/home/christoph/scribus133/Version133x/Scribus/scribus/scpainter.h:64: error: forward declaration of ‘struct _ArtBpath’
/home/christoph/scribus133/Version133x/Scribus/scribus/scpainter.cpp:991: error: invalid use of incomplete type ‘struct _ArtBpath’
/home/christoph/scribus133/Version133x/Scribus/scribus/scpainter.h:64: error: forward declaration of ‘struct _ArtBpath’
/home/christoph/scribus133/Version133x/Scribus/scribus/scpainter.cpp:991: error: invalid use of incomplete type ‘struct _ArtBpath’
/home/christoph/scribus133/Version133x/Scribus/scribus/scpainter.h:64: error: forward declaration of ‘struct _ArtBpath’
/home/christoph/scribus133/Version133x/Scribus/scribus/scpainter.cpp:1002: error: invalid use of incomplete type ‘struct _ArtBpath’
/home/christoph/scribus133/Version133x/Scribus/scribus/scpainter.h:64: error: forward declaration of ‘struct _ArtBpath’
/home/christoph/scribus133/Version133x/Scribus/scribus/scpainter.cpp:1002: error: invalid use of incomplete type ‘struct _ArtBpath’
/home/christoph/scribus133/Version133x/Scribus/scribus/scpainter.h:64: error: forward declaration of ‘struct _ArtBpath’
/home/christoph/scribus133/Version133x/Scribus/scribus/scpainter.cpp:1002: error: ‘ART_LINETO’ was not declared in this scope
/home/christoph/scribus133/Version133x/Scribus/scribus/scpainter.cpp:1003: error: invalid use of incomplete type ‘struct _ArtBpath’
/home/christoph/scribus133/Version133x/Scribus/scribus/scpainter.h:64: error: forward declaration of ‘struct _ArtBpath’
/home/christoph/scribus133/Version133x/Scribus/scribus/scpainter.cpp:1003: error: invalid use of incomplete type ‘struct _ArtBpath’
/home/christoph/scribus133/Version133x/Scribus/scribus/scpainter.h:64: error: forward declaration of ‘struct _ArtBpath’
/home/christoph/scribus133/Version133x/Scribus/scribus/scpainter.cpp:1004: error: invalid use of incomplete type ‘struct _ArtBpath’
/home/christoph/scribus133/Version133x/Scribus/scribus/scpainter.h:64: error: forward declaration of ‘struct _ArtBpath’
/home/christoph/scribus133/Version133x/Scribus/scribus/scpainter.cpp:1004: error: invalid use of incomplete type ‘struct _ArtBpath’
/home/christoph/scribus133/Version133x/Scribus/scribus/scpainter.h:64: error: forward declaration of ‘struct _ArtBpath’
/home/christoph/scribus133/Version133x/Scribus/scribus/scpainter.cpp:1008: error: invalid use of incomplete type ‘struct _ArtBpath’
/home/christoph/scribus133/Version133x/Scribus/scribus/scpainter.h:64: error: forward declaration of ‘struct _ArtBpath’
/home/christoph/scribus133/Version133x/Scribus/scribus/scpainter.cpp:1008: error: invalid use of incomplete type ‘struct _ArtBpath’
/home/christoph/scribus133/Version133x/Scribus/scribus/scpainter.h:64: error: forward declaration of ‘struct _ArtBpath’
/home/christoph/scribus133/Version133x/Scribus/scribus/scpainter.cpp:1008: error: ‘ART_CURVETO’ was not declared in this scope
/home/christoph/scribus133/Version133x/Scribus/scribus/scpainter.cpp:1009: error: invalid use of incomplete type ‘struct _ArtBpath’
/home/christoph/scribus133/Version133x/Scribus/scribus/scpainter.h:64: error: forward declaration of ‘struct _ArtBpath’
/home/christoph/scribus133/Version133x/Scribus/scribus/scpainter.cpp:1009: error: invalid use of incomplete type ‘struct _ArtBpath’
/home/christoph/scribus133/Version133x/Scribus/scribus/scpainter.h:64: error: forward declaration of ‘struct _ArtBpath’
/home/christoph/scribus133/Version133x/Scribus/scribus/scpainter.cpp:1010: error: invalid use of incomplete type ‘struct _ArtBpath’
/home/christoph/scribus133/Version133x/Scribus/scribus/scpainter.h:64: error: forward declaration of ‘struct _ArtBpath’
/home/christoph/scribus133/Version133x/Scribus/scribus/scpainter.cpp:1010: error: invalid use of incomplete type ‘struct _ArtBpath’
/home/christoph/scribus133/Version133x/Scribus/scribus/scpainter.h:64: error: forward declaration of ‘struct _ArtBpath’
/home/christoph/scribus133/Version133x/Scribus/scribus/scpainter.cpp:1011: error: invalid use of incomplete type ‘struct _ArtBpath’
/home/christoph/scribus133/Version133x/Scribus/scribus/scpainter.h:64: error: forward declaration of ‘struct _ArtBpath’
/home/christoph/scribus133/Version133x/Scribus/scribus/scpainter.cpp:1011: error: invalid use of incomplete type ‘struct _ArtBpath’
/home/christoph/scribus133/Version133x/Scribus/scribus/scpainter.h:64: error: forward declaration of ‘struct _ArtBpath’
/home/christoph/scribus133/Version133x/Scribus/scribus/scpainter.cpp:1012: error: invalid use of incomplete type ‘struct _ArtBpath’
/home/christoph/scribus133/Version133x/Scribus/scribus/scpainter.h:64: error: forward declaration of ‘struct _ArtBpath’
/home/christoph/scribus133/Version133x/Scribus/scribus/scpainter.cpp:1012: error: invalid use of incomplete type ‘struct _ArtBpath’
/home/christoph/scribus133/Version133x/Scribus/scribus/scpainter.h:64: error: forward declaration of ‘struct _ArtBpath’
/home/christoph/scribus133/Version133x/Scribus/scribus/scpainter.cpp:1013: error: invalid use of incomplete type ‘struct _ArtBpath’
/home/christoph/scribus133/Version133x/Scribus/scribus/scpainter.h:64: error: forward declaration of ‘struct _ArtBpath’
/home/christoph/scribus133/Version133x/Scribus/scribus/scpainter.cpp:1013: error: invalid use of incomplete type ‘struct _ArtBpath’
/home/christoph/scribus133/Version133x/Scribus/scribus/scpainter.h:64: error: forward declaration of ‘struct _ArtBpath’
/home/christoph/scribus133/Version133x/Scribus/scribus/scpainter.cpp:1014: error: invalid use of incomplete type ‘struct _ArtBpath’
/home/christoph/scribus133/Version133x/Scribus/scribus/scpainter.h:64: error: forward declaration of ‘struct _ArtBpath’
/home/christoph/scribus133/Version133x/Scribus/scribus/scpainter.cpp:1014: error: invalid use of incomplete type ‘struct _ArtBpath’
/home/christoph/scribus133/Version133x/Scribus/scribus/scpainter.h:64: error: forward declaration of ‘struct _ArtBpath’
/home/christoph/scribus133/Version133x/Scribus/scribus/scpainter.cpp:1019: error: invalid use of incomplete type ‘struct _ArtBpath’
/home/christoph/scribus133/Version133x/Scribus/scribus/scpainter.h:64: error: forward declaration of ‘struct _ArtBpath’
/home/christoph/scribus133/Version133x/Scribus/scribus/scpainter.cpp:1019: error: invalid use of incomplete type ‘struct _ArtBpath’
/home/christoph/scribus133/Version133x/Scribus/scribus/scpainter.h:64: error: forward declaration of ‘struct _ArtBpath’
/home/christoph/scribus133/Version133x/Scribus/scribus/scpainter.cpp:1019: error: ‘ART_END’ was not declared in this scope
/home/christoph/scribus133/Version133x/Scribus/scribus/scpainter.cpp: In member function ‘virtual void ScPainter::setupTextPolygon(FPointArray*)’:
/home/christoph/scribus133/Version133x/Scribus/scribus/scpainter.cpp:1065: error: invalid use of incomplete type ‘struct _ArtBpath’
/home/christoph/scribus133/Version133x/Scribus/scribus/scpainter.h:64: error: forward declaration of ‘struct _ArtBpath’
/home/christoph/scribus133/Version133x/Scribus/scribus/scpainter.cpp:1065: error: invalid use of incomplete type ‘struct _ArtBpath’
/home/christoph/scribus133/Version133x/Scribus/scribus/scpainter.h:64: error: forward declaration of ‘struct _ArtBpath’
/home/christoph/scribus133/Version133x/Scribus/scribus/scpainter.cpp:1065: error: ‘ART_END’ was not declared in this scope
/home/christoph/scribus133/Version133x/Scribus/scribus/scpainter.cpp:1072: error: invalid use of incomplete type ‘struct _ArtBpath’
/home/christoph/scribus133/Version133x/Scribus/scribus/scpainter.h:64: error: forward declaration of ‘struct _ArtBpath’
/home/christoph/scribus133/Version133x/Scribus/scribus/scpainter.cpp:1072: error: invalid use of incomplete type ‘struct _ArtBpath’
/home/christoph/scribus133/Version133x/Scribus/scribus/scpainter.h:64: error: forward declaration of ‘struct _ArtBpath’
/home/christoph/scribus133/Version133x/Scribus/scribus/scpainter.cpp:1072: error: ‘ART_MOVETO’ was not declared in this scope
/home/christoph/scribus133/Version133x/Scribus/scribus/scpainter.cpp:1073: error: invalid use of incomplete type ‘struct _ArtBpath’
/home/christoph/scribus133/Version133x/Scribus/scribus/scpainter.h:64: error: forward declaration of ‘struct _ArtBpath’
/home/christoph/scribus133/Version133x/Scribus/scribus/scpainter.cpp:1073: error: invalid use of incomplete type ‘struct _ArtBpath’
/home/christoph/scribus133/Version133x/Scribus/scribus/scpainter.h:64: error: forward declaration of ‘struct _ArtBpath’
/home/christoph/scribus133/Version133x/Scribus/scribus/scpainter.cpp:1074: error: invalid use of incomplete type ‘struct _ArtBpath’
/home/christoph/scribus133/Version133x/Scribus/scribus/scpainter.h:64: error: forward declaration of ‘struct _ArtBpath’
/home/christoph/scribus133/Version133x/Scribus/scribus/scpainter.cpp:1074: error: invalid use of incomplete type ‘struct _ArtBpath’
/home/christoph/scribus133/Version133x/Scribus/scribus/scpainter.h:64: error: forward declaration of ‘struct _ArtBpath’
/home/christoph/scribus133/Version133x/Scribus/scribus/scpainter.cpp:1085: error: invalid use of incomplete type ‘struct _ArtBpath’
/home/christoph/scribus133/Version133x/Scribus/scribus/scpainter.h:64: error: forward declaration of ‘struct _ArtBpath’
/home/christoph/scribus133/Version133x/Scribus/scribus/scpainter.cpp:1085: error: invalid use of incomplete type ‘struct _ArtBpath’
/home/christoph/scribus133/Version133x/Scribus/scribus/scpainter.h:64: error: forward declaration of ‘struct _ArtBpath’
/home/christoph/scribus133/Version133x/Scribus/scribus/scpainter.cpp:1085: error: ‘ART_LINETO’ was not declared in this scope
/home/christoph/scribus133/Version133x/Scribus/scribus/scpainter.cpp:1086: error: invalid use of incomplete type ‘struct _ArtBpath’
/home/christoph/scribus133/Version133x/Scribus/scribus/scpainter.h:64: error: forward declaration of ‘struct _ArtBpath’
/home/christoph/scribus133/Version133x/Scribus/scribus/scpainter.cpp:1086: error: invalid use of incomplete type ‘struct _ArtBpath’
/home/christoph/scribus133/Version133x/Scribus/scribus/scpainter.h:64: error: forward declaration of ‘struct _ArtBpath’
/home/christoph/scribus133/Version133x/Scribus/scribus/scpainter.cpp:1087: error: invalid use of incomplete type ‘struct _ArtBpath’
/home/christoph/scribus133/Version133x/Scribus/scribus/scpainter.h:64: error: forward declaration of ‘struct _ArtBpath’
/home/christoph/scribus133/Version133x/Scribus/scribus/scpainter.cpp:1087: error: invalid use of incomplete type ‘struct _ArtBpath’
/home/christoph/scribus133/Version133x/Scribus/scribus/scpainter.h:64: error: forward declaration of ‘struct _ArtBpath’
/home/christoph/scribus133/Version133x/Scribus/scribus/scpainter.cpp:1091: error: invalid use of incomplete type ‘struct _ArtBpath’
/home/christoph/scribus133/Version133x/Scribus/scribus/scpainter.h:64: error: forward declaration of ‘struct _ArtBpath’
/home/christoph/scribus133/Version133x/Scribus/scribus/scpainter.cpp:1091: error: invalid use of incomplete type ‘struct _ArtBpath’
/home/christoph/scribus133/Version133x/Scribus/scribus/scpainter.h:64: error: forward declaration of ‘struct _ArtBpath’
/home/christoph/scribus133/Version133x/Scribus/scribus/scpainter.cpp:1091: error: ‘ART_CURVETO’ was not declared in this scope
/home/christoph/scribus133/Version133x/Scribus/scribus/scpainter.cpp:1092: error: invalid use of incomplete type ‘struct _ArtBpath’
/home/christoph/scribus133/Version133x/Scribus/scribus/scpainter.h:64: error: forward declaration of ‘struct _ArtBpath’
/home/christoph/scribus133/Version133x/Scribus/scribus/scpainter.cpp:1092: error: invalid use of incomplete type ‘struct _ArtBpath’
/home/christoph/scribus133/Version133x/Scribus/scribus/scpainter.h:64: error: forward declaration of ‘struct _ArtBpath’
/home/christoph/scribus133/Version133x/Scribus/scribus/scpainter.cpp:1093: error: invalid use of incomplete type ‘struct _ArtBpath’
/home/christoph/scribus133/Version133x/Scribus/scribus/scpainter.h:64: error: forward declaration of ‘struct _ArtBpath’
/home/christoph/scribus133/Version133x/Scribus/scribus/scpainter.cpp:1093: error: invalid use of incomplete type ‘struct _ArtBpath’
/home/christoph/scribus133/Version133x/Scribus/scribus/scpainter.h:64: error: forward declaration of ‘struct _ArtBpath’
/home/christoph/scribus133/Version133x/Scribus/scribus/scpainter.cpp:1094: error: invalid use of incomplete type ‘struct _ArtBpath’
/home/christoph/scribus133/Version133x/Scribus/scribus/scpainter.h:64: error: forward declaration of ‘struct _ArtBpath’
/home/christoph/scribus133/Version133x/Scribus/scribus/scpainter.cpp:1094: error: invalid use of incomplete type ‘struct _ArtBpath’
/home/christoph/scribus133/Version133x/Scribus/scribus/scpainter.h:64: error: forward declaration of ‘struct _ArtBpath’
/home/christoph/scribus133/Version133x/Scribus/scribus/scpainter.cpp:1095: error: invalid use of incomplete type ‘struct _ArtBpath’
/home/christoph/scribus133/Version133x/Scribus/scribus/scpainter.h:64: error: forward declaration of ‘struct _ArtBpath’
/home/christoph/scribus133/Version133x/Scribus/scribus/scpainter.cpp:1095: error: invalid use of incomplete type ‘struct _ArtBpath’
/home/christoph/scribus133/Version133x/Scribus/scribus/scpainter.h:64: error: forward declaration of ‘struct _ArtBpath’
/home/christoph/scribus133/Version133x/Scribus/scribus/scpainter.cpp:1096: error: invalid use of incomplete type ‘struct _ArtBpath’
/home/christoph/scribus133/Version133x/Scribus/scribus/scpainter.h:64: error: forward declaration of ‘struct _ArtBpath’
/home/christoph/scribus133/Version133x/Scribus/scribus/scpainter.cpp:1096: error: invalid use of incomplete type ‘struct _ArtBpath’
/home/christoph/scribus133/Version133x/Scribus/scribus/scpainter.h:64: error: forward declaration of ‘struct _ArtBpath’
/home/christoph/scribus133/Version133x/Scribus/scribus/scpainter.cpp:1097: error: invalid use of incomplete type ‘struct _ArtBpath’
/home/christoph/scribus133/Version133x/Scribus/scribus/scpainter.h:64: error: forward declaration of ‘struct _ArtBpath’
/home/christoph/scribus133/Version133x/Scribus/scribus/scpainter.cpp:1097: error: invalid use of incomplete type ‘struct _ArtBpath’
/home/christoph/scribus133/Version133x/Scribus/scribus/scpainter.h:64: error: forward declaration of ‘struct _ArtBpath’
/home/christoph/scribus133/Version133x/Scribus/scribus/scpainter.cpp:1102: error: invalid use of incomplete type ‘struct _ArtBpath’
/home/christoph/scribus133/Version133x/Scribus/scribus/scpainter.h:64: error: forward declaration of ‘struct _ArtBpath’
/home/christoph/scribus133/Version133x/Scribus/scribus/scpainter.cpp:1102: error: invalid use of incomplete type ‘struct _ArtBpath’
/home/christoph/scribus133/Version133x/Scribus/scribus/scpainter.h:64: error: forward declaration of ‘struct _ArtBpath’
/home/christoph/scribus133/Version133x/Scribus/scribus/scpainter.cpp:1102: error: ‘ART_END’ was not declared in this scope
/home/christoph/scribus133/Version133x/Scribus/scribus/scpainter.cpp: In member function ‘virtual void ScPainter::drawRect(double, double, double, double)’:
/home/christoph/scribus133/Version133x/Scribus/scribus/scpainter.cpp:1137: error: invalid use of incomplete type ‘struct _ArtBpath’
/home/christoph/scribus133/Version133x/Scribus/scribus/scpainter.h:64: error: forward declaration of ‘struct _ArtBpath’
/home/christoph/scribus133/Version133x/Scribus/scribus/scpainter.cpp:1137: error: invalid use of incomplete type ‘struct _ArtBpath’
/home/christoph/scribus133/Version133x/Scribus/scribus/scpainter.h:64: error: forward declaration of ‘struct _ArtBpath’
/home/christoph/scribus133/Version133x/Scribus/scribus/scpainter.cpp:1137: error: ‘ART_END’ was not declared in this scope
/home/christoph/scribus133/Version133x/Scribus/scribus/scpainter.cpp: In member function ‘void ScPainter::ensureSpace(unsigned int)’:
/home/christoph/scribus133/Version133x/Scribus/scribus/scpainter.cpp:1150: error: ‘ArtBpath’ was not declared in this scope
/home/christoph/scribus133/Version133x/Scribus/scribus/scpainter.cpp:1150: error: ‘art_new’ was not declared in this scope
/home/christoph/scribus133/Version133x/Scribus/scribus/scpainter.cpp:1156: error: ‘ArtBpath’ was not declared in this scope
/home/christoph/scribus133/Version133x/Scribus/scribus/scpainter.cpp:1156: error: ‘art_renew’ was not declared in this scope
/home/christoph/scribus133/Version133x/Scribus/scribus/scpainter.cpp: In member function ‘virtual void ScPainter::resize(unsigned int, unsigned int)’:
/home/christoph/scribus133/Version133x/Scribus/scribus/scpainter.cpp:1165: error: ‘art_free’ was not declared in this scope
/home/christoph/scribus133/Version133x/Scribus/scribus/scpainter.cpp:1170: error: ‘art_u8’ was not declared in this scope
/home/christoph/scribus133/Version133x/Scribus/scribus/scpainter.cpp:1170: error: ‘art_new’ was not declared in this scope
/home/christoph/scribus133/Version133x/Scribus/scribus/scpainter.cpp: In member function ‘void ScPainter::clampToViewport(const _ArtSVP&, int&, int&, int&, int&)’:
/home/christoph/scribus133/Version133x/Scribus/scribus/scpainter.cpp:1189: error: ‘ArtDRect’ was not declared in this scope
/home/christoph/scribus133/Version133x/Scribus/scribus/scpainter.cpp:1189: error: expected `;' before ‘bbox’
/home/christoph/scribus133/Version133x/Scribus/scribus/scpainter.cpp:1190: error: ‘bbox’ was not declared in this scope
/home/christoph/scribus133/Version133x/Scribus/scribus/scpainter.cpp:1190: error: ‘art_drect_svp’ was not declared in this scope
/home/christoph/scribus133/Version133x/Scribus/scribus/scpainter.cpp: In member function ‘void ScPainter::applyGradient(_ArtSVP*, bool)’:
/home/christoph/scribus133/Version133x/Scribus/scribus/scpainter.cpp:1209: error: ‘ArtRender’ was not declared in this scope
/home/christoph/scribus133/Version133x/Scribus/scribus/scpainter.cpp:1209: error: ‘render’ was not declared in this scope
/home/christoph/scribus133/Version133x/Scribus/scribus/scpainter.cpp:1218: error: expected primary-expression before ‘,’ token
/home/christoph/scribus133/Version133x/Scribus/scribus/scpainter.cpp:1218: error: ‘art_new’ was not declared in this scope
/home/christoph/scribus133/Version133x/Scribus/scribus/scpainter.cpp:1241: error: ‘ART_ALPHA_PREMUL’ was not declared in this scope
/home/christoph/scribus133/Version133x/Scribus/scribus/scpainter.cpp:1241: error: ‘art_render_new’ was not declared in this scope
/home/christoph/scribus133/Version133x/Scribus/scribus/scpainter.cpp:1243: error: ‘art_render_svp’ was not declared in this scope
/home/christoph/scribus133/Version133x/Scribus/scribus/scpainter.cpp:1244: error: ‘art_render_mask_solid’ was not declared in this scope
/home/christoph/scribus133/Version133x/Scribus/scribus/scpainter.cpp:1245: error: ‘ART_FILTER_NEAREST’ was not declared in this scope
/home/christoph/scribus133/Version133x/Scribus/scribus/scpainter.cpp:1245: error: ‘art_karbon_render_gradient_linear’ was not declared in this scope
/home/christoph/scribus133/Version133x/Scribus/scribus/scpainter.cpp:1246: error: ‘art_render_invoke’ was not declared in this scope
/home/christoph/scribus133/Version133x/Scribus/scribus/scpainter.cpp:1248: error: ‘art_free’ was not declared in this scope
/home/christoph/scribus133/Version133x/Scribus/scribus/scpainter.cpp:1253: error: expected primary-expression before ‘,’ token
/home/christoph/scribus133/Version133x/Scribus/scribus/scpainter.cpp:1253: error: ‘art_new’ was not declared in this scope
/home/christoph/scribus133/Version133x/Scribus/scribus/scpainter.cpp:1270: error: ‘art_affine_scale’ was not declared in this scope
/home/christoph/scribus133/Version133x/Scribus/scribus/scpainter.cpp:1271: error: ‘art_affine_translate’ was not declared in this scope
/home/christoph/scribus133/Version133x/Scribus/scribus/scpainter.cpp:1272: error: ‘art_affine_multiply’ was not declared in this scope
/home/christoph/scribus133/Version133x/Scribus/scribus/scpainter.cpp:1274: error: ‘art_affine_invert’ was not declared in this scope
/home/christoph/scribus133/Version133x/Scribus/scribus/scpainter.cpp:1280: error: ‘ART_ALPHA_PREMUL’ was not declared in this scope
/home/christoph/scribus133/Version133x/Scribus/scribus/scpainter.cpp:1280: error: ‘art_render_new’ was not declared in this scope
/home/christoph/scribus133/Version133x/Scribus/scribus/scpainter.cpp:1282: error: ‘art_render_svp’ was not declared in this scope
/home/christoph/scribus133/Version133x/Scribus/scribus/scpainter.cpp:1283: error: ‘art_render_mask_solid’ was not declared in this scope
/home/christoph/scribus133/Version133x/Scribus/scribus/scpainter.cpp:1284: error: ‘ART_FILTER_NEAREST’ was not declared in this scope
/home/christoph/scribus133/Version133x/Scribus/scribus/scpainter.cpp:1284: error: ‘art_karbon_render_gradient_radial’ was not declared in this scope
/home/christoph/scribus133/Version133x/Scribus/scribus/scpainter.cpp:1285: error: ‘art_render_invoke’ was not declared in this scope
/home/christoph/scribus133/Version133x/Scribus/scribus/scpainter.cpp:1287: error: ‘art_free’ was not declared in this scope
/home/christoph/scribus133/Version133x/Scribus/scribus/scpainter.cpp: In member function ‘ArtGradientStop* ScPainter::buildStopArray(VGradient&, int&)’:
/home/christoph/scribus133/Version133x/Scribus/scribus/scpainter.cpp:1296: error: expected primary-expression before ‘,’ token
/home/christoph/scribus133/Version133x/Scribus/scribus/scpainter.cpp:1296: error: ‘art_new’ was not declared in this scope
/home/christoph/scribus133/Version133x/Scribus/scribus/scpainter.cpp:1320: error: ‘art_u32’ was not declared in this scope
/home/christoph/scribus133/Version133x/Scribus/scribus/scpainter.cpp:1320: error: expected `;' before ‘rgba’
/home/christoph/scribus133/Version133x/Scribus/scribus/scpainter.cpp:1322: error: ‘rgba’ was not declared in this scope
/home/christoph/scribus133/Version133x/Scribus/scribus/scpainter.cpp:1328: error: ‘struct _ArtGradientStop’ has no member named ‘color’
/home/christoph/scribus133/Version133x/Scribus/scribus/scpainter.cpp:1328: error: ‘ART_PIX_MAX_FROM_8’ was not declared in this scope
/home/christoph/scribus133/Version133x/Scribus/scribus/scpainter.cpp:1329: error: ‘struct _ArtGradientStop’ has no member named ‘color’
/home/christoph/scribus133/Version133x/Scribus/scribus/scpainter.cpp:1330: error: ‘struct _ArtGradientStop’ has no member named ‘color’
/home/christoph/scribus133/Version133x/Scribus/scribus/scpainter.cpp:1331: error: ‘struct _ArtGradientStop’ has no member named ‘color’
/home/christoph/scribus133/Version133x/Scribus/scribus/scpainter.cpp:1347: error: ‘struct _ArtGradientStop’ has no member named ‘color’
/home/christoph/scribus133/Version133x/Scribus/scribus/scpainter.cpp:1348: error: ‘struct _ArtGradientStop’ has no member named ‘color’
/home/christoph/scribus133/Version133x/Scribus/scribus/scpainter.cpp:1349: error: ‘struct _ArtGradientStop’ has no member named ‘color’
/home/christoph/scribus133/Version133x/Scribus/scribus/scpainter.cpp:1350: error: ‘struct _ArtGradientStop’ has no member named ‘color’
make[2]: *** [scribus/CMakeFiles/scribus.dir/scpainter.o] Fehler 1
make[1]: *** [scribus/CMakeFiles/scribus.dir/all] Fehler 2
make: *** [all] Fehler 2