All pastes #817543 Raw Edit

emerge libcaca error

public shellscript v1 · immutable
·published 2007-12-15 17:57 UTC
rendered paste body
touch stamp-doxygenrm -f latex/libcaca.tex latex/libcaca.pdfmv latex/refman.tex latex/libcaca.texsed 's/setlength{/renewcommand{/' latex/libcaca.tex > latex/refman.texcd latex && make  refman.pdfmake[3]: Entering directory `/var/tmp/portage/media-libs/libcaca-0.99_beta12/work/libcaca-0.99.beta12/doc/latex'pdflatex refman.texThis is pdfTeXk, Version 3.141592-1.40.3 (Web2C 7.5.6) %&-line parsing enabled.entering extended mode(./refman.texLaTeX2e <2005/12/01>Babel <v3.8h> and hyphenation patterns for english, usenglishmax, dumylang, nohyphenation, loaded.make[3]: *** [refman.pdf] Error 1make[3]: Leaving directory `/var/tmp/portage/media-libs/libcaca-0.99_beta12/work/libcaca-0.99.beta12/doc/latex'make[2]: *** [stamp-latex] Error 2make[2]: Leaving directory `/var/tmp/portage/media-libs/libcaca-0.99_beta12/work/libcaca-0.99.beta12/doc'make[1]: *** [all-recursive] Error 1make[1]: Leaving directory `/var/tmp/portage/media-libs/libcaca-0.99_beta12/work/libcaca-0.99.beta12'make: *** [all] Error 2 *  * ERROR: media-libs/libcaca-0.99_beta12 failed. * Call stack: *               ebuild.sh, line   46:  Called src_compile *             environment, line 2473:  Called die * The specific snippet of code: *       emake || diefunc "$FUNCNAME" "$LINENO" "$?" "emake failed"; *  The die message: *   emake failed *  * If you need support, post the topmost build error, and the call stack if relevant. * A complete build log is located at '/var/tmp/portage/media-libs/libcaca-0.99_beta12/temp/build.log'. * The ebuild environment file is located at '/var/tmp/portage/media-libs/libcaca-0.99_beta12/temp/environment'. *  * Messages for package dev-lang/ruby-1.8.6_p110-r2: *  * You can change the default ruby interpreter by /usr/sbin/ruby-config *  * If you upgrade to >=sys-apps/coreutils-6.7-r1, * you should re-emerge ruby again. * See bug #159922 for details *  * Messages for package app-text/texlive-core-2007-r10: * Symlink aleph -> aleph skipped * Making symlink from lamed to aleph * Making symlink from etex to pdftex * Symlink mf skipped (file exists) * Symlink omega -> omega skipped * Making symlink from lambda to omega * Symlink pdftex -> pdftex skipped * Making symlink from pdflatex to pdftex * Making symlink from pdfetex to pdftex * Symlink tex -> tex skipped * Symlink xetex -> xetex skipped * Making symlink from xelatex to xetex *  * If you have configuration files in /etc/texmf to merge, * please update them and run /usr/sbin/texmf-update. *  * Messages for package dev-texlive/texlive-latex-2007: * Making symlink from latex to pdftex * Messages for package media-libs/libcaca-0.99_beta12: *  * ERROR: media-libs/libcaca-0.99_beta12 failed. * Call stack: *               ebuild.sh, line   46:  Called src_compile *             environment, line 2473:  Called die * The specific snippet of code: *       emake || diefunc "$FUNCNAME" "$LINENO" "$?" "emake failed"; *  The die message: *   emake failed *  * If you need support, post the topmost build error, and the call stack if relevant. * A complete build log is located at '/var/tmp/portage/media-libs/libcaca-0.99_beta12/temp/build.log'. * The ebuild environment file is located at '/var/tmp/portage/media-libs/libcaca-0.99_beta12/temp/environment'. *  * Regenerating GNU info directory index... * Processed 120 info files.