rendered paste body -c -o print-message.lo `test -f 'print-message.c' || echo './'`print-message.c; \
then mv -f ".deps/print-message.Tpo" ".deps/print-message.Plo"; \
else rm -f ".deps/print-message.Tpo"; exit 1; \
fi
mkdir .libs
gcc -DHAVE_CONFIG_H -I. -I. -I../.. -I../.. -I../../composer -DORBIT2=1 -pthread -I/opt/gnome2/include/evolution-data-server-1.8 -I/opt/gnome2/include/libgtkhtml-3.8 -I/usr/include/libart-2.0 -I/usr/include/cairo -I/usr/include/freetype2 -I/usr/X11R6/include -I/usr/include/libpng12 -I/usr/include/libxml2 -I/opt/gnome/include/libgnome-2.0 -I/opt/gnome/include/glib-2.0 -I/opt/gnome/lib/glib-2.0/include -I/opt/gnome/include/orbit-2.0 -I/opt/gnome/include/libbonobo-2.0 -I/opt/gnome/include/gconf/2 -I/opt/gnome/include/gnome-vfs-2.0 -I/opt/gnome/lib/gnome-vfs-2.0/include -I/opt/gnome/include/bonobo-activation-2.0 -I/opt/gnome/include/libgnomeui-2.0 -I/opt/gnome/include/libgnomecanvas-2.0 -I/opt/gnome/include/gtk-2.0 -I/opt/gnome/include/libbonoboui-2.0 -I/opt/gnome/include/gnome-keyring-1 -I/opt/gnome/include/pango-1.0 -I/opt/gnome/lib/gtk-2.0/include -I/opt/gnome/include/atk-1.0 -I/opt/gnome/include/libglade-2.0 -I/opt/gnome/include/gnome-vfs-module-2.0 -I/opt/gnome/include/libgnomeprint-2.2 -I/opt/gnome/include/libgnomeprintui-2.2 -g -O2 -Wall -Wmissing-prototypes -Wno-sign-compare -MT print-message.lo -MD -MP -MF .deps/print-message.Tpo -c print-message.c -fPIC -DPIC -o .libs/print-message.o
In file included from /opt/gnome/include/gtk-2.0/gtk/gtktextbuffer.h:31,
from /opt/gnome/include/libgnomecanvas-2.0/libgnomecanvas/gnome-canvas-rich-text.h:27,
from /opt/gnome/include/libgnomeui-2.0/libgnomeui/gnome-icon-list.h:42,
from ../../widgets/misc/e-attachment-bar.h:28,
from ../../mail/em-format-html-display.h:10,
from print-message.c:29:
/opt/gnome/include/gtk-2.0/gtk/gtkclipboard.h:35: error: stray '\240' in program
make[4]: *** [print-message.lo] Error 1
make[4]: Leaving directory `/home/atul/cvs/gnome2/evolution/plugins/print-message'
make[3]: *** [all] Error 2
rm org-gnome-print-message.eplug.in
make[3]: Leaving directory `/home/atul/cvs/gnome2/evolution/plugins/print-message'
make[2]: *** [all-recursive] Error 1
make[2]: Leaving directory `/home/atul/cvs/gnome2/evolution/plugins'
make[1]: *** [all-recursive] Error 1
make[1]: Leaving directory `/home/atul/cvs/gnome2/evolution'
make: *** [all] Error 2
*** error during stage build of evolution: Error running make *** [1/1]
[1] rerun stage build
[2] ignore error and continue to install
[3] give up on module
[4] start shell
[5] go to stage force_checkout
[6] go to stage configure
choice: