libZeroPAD_a-linux.o -MD -MP -MF .deps/libZeroPAD_a-linux.Tpo -c -o libZeroPAD_a-linux.o `test -f 'Linux/linux.cpp' || echo './'`Linux/linux.cpp
Linux/linux.cpp:25:17: error: SDL.h: No such file or directory
Linux/linux.cpp:71: error: ISO C++ forbids declaration of ‘SDL_Joystick’ with no type
Linux/linux.cpp:71: error: expected ‘;’ before ‘*’ token
Linux/linux.cpp:74: error: expected `;' before ‘private’
Linux/linux.cpp:85: error: ISO C++ forbids declaration of ‘SDL_Joystick’ with no type
Linux/linux.cpp:85: error: expected ‘;’ before ‘*’ token
Linux/linux.cpp: In function ‘void PADupdate(int)’:
Linux/linux.cpp:319: error: ‘SDL_JoystickUpdate’ was not declared in this scope
Linux/linux.cpp:328: error: ‘class JoystickInfo’ has no member named ‘GetJoy’
Linux/linux.cpp:328: error: ‘SDL_JoystickGetButton’ was not declared in this scope
Linux/linux.cpp:340: error: ‘class JoystickInfo’ has no member named ‘GetJoy’
Linux/linux.cpp:340: error: ‘SDL_JoystickGetAxis’ was not declared in this scope
Linux/linux.cpp:388: error: ‘class JoystickInfo’ has no member named ‘GetJoy’
Linux/linux.cpp:388: error: ‘SDL_JoystickGetAxis’ was not declared in this scope
Linux/linux.cpp: In function ‘void OnConf_Key(GtkButton*, void*)’:
Linux/linux.cpp:499: error: ‘SDL_JoystickUpdate’ was not declared in this scope
Linux/linux.cpp:525: error: ‘class JoystickInfo’ has no member named ‘GetJoy’
Linux/linux.cpp:525: error: ‘SDL_JoystickGetButton’ was not declared in this scope
Linux/linux.cpp:542: error: ‘class JoystickInfo’ has no member named ‘GetJoy’
Linux/linux.cpp:542: error: ‘SDL_JoystickGetAxis’ was not declared in this scope
Linux/linux.cpp: In static member function ‘static void JoystickInfo::EnumerateJoysticks(std::vector<JoystickInfo*, std::allocator<JoystickInfo*> >&)’:
Linux/linux.cpp:717: error: ‘SDL_INIT_JOYSTICK’ was not declared in this scope
Linux/linux.cpp:717: error: ‘SDL_Init’ was not declared in this scope
Linux/linux.cpp:719: error: ‘SDL_QUERY’ was not declared in this scope
Linux/linux.cpp:719: error: ‘SDL_JoystickEventState’ was not declared in this scope
Linux/linux.cpp:726: error: ‘SDL_NumJoysticks’ was not declared in this scope
Linux/linux.cpp: In constructor ‘JoystickInfo::JoystickInfo()’:
Linux/linux.cpp:753: error: ‘joy’ was not declared in this scope
Linux/linux.cpp: In member function ‘void JoystickInfo::Destroy()’:
Linux/linux.cpp:764: error: ‘joy’ was not declared in this scope
Linux/linux.cpp:765: error: ‘SDL_JoystickOpened’ was not declared in this scope
Linux/linux.cpp:766: error: ‘SDL_JoystickClose’ was not declared in this scope
Linux/linux.cpp: In member function ‘bool JoystickInfo::Init(int, bool)’:
Linux/linux.cpp:778: error: ‘joy’ was not declared in this scope
Linux/linux.cpp:778: error: ‘SDL_JoystickOpen’ was not declared in this scope
Linux/linux.cpp:784: error: ‘SDL_JoystickNumAxes’ was not declared in this scope
Linux/linux.cpp:785: error: ‘SDL_JoystickNumButtons’ was not declared in this scope
Linux/linux.cpp:786: error: ‘SDL_JoystickNumHats’ was not declared in this scope
Linux/linux.cpp:787: error: ‘SDL_JoystickName’ was not declared in this scope
Linux/linux.cpp: In member function ‘void JoystickInfo::SaveState()’:
Linux/linux.cpp:821: error: ‘joy’ was not declared in this scope
Linux/linux.cpp:821: error: ‘SDL_JoystickGetButton’ was not declared in this scope
Linux/linux.cpp:823: error: ‘joy’ was not declared in this scope
Linux/linux.cpp:823: error: ‘SDL_JoystickGetAxis’ was not declared in this scope
make: *** [libZeroPAD_a-linux.o] Error 1
Error with building plugins