All pastes #817366 Raw Edit

Anatolay

public text v1 · immutable
·published 2007-12-15 14:53 UTC
rendered paste body
Build of revision 993.------- BUILD -------qxthash.h:29:23: error: qxtglobal.h: No such file or directoryqxthash.h:30:22: error: qxtpimpl.h: No such file or directoryqxthash_p.h:1:17: error: md5.h: No such file or directoryqxthash_p.h:2:17: error: md4.h: No such file or directoryqxthash.h:33: error: function definition does not declare parametersqxthash_p.h:3: error: expected template-name before ‘<’ tokenqxthash_p.h:3: error: expected `{' before ‘<’ tokenqxthash_p.h:3: error: expected unqualified-id before ‘<’ tokenqxthash.cpp:43: error: ‘QxtHash’ has not been declaredqxthash.cpp:43: error: expected constructor, destructor, or type conversion before ‘(’ tokenqxthash.cpp:53: error: ‘QxtHash’ has not been declaredqxthash.cpp:53: error: expected constructor, destructor, or type conversion before ‘(’ tokenqxthash.cpp:65: error: ‘QxtHash’ has not been declaredqxthash.cpp:67: error: ‘qxt_d’ was not declared in this scopeqxthash.cpp:67: error: ‘Md5’ was not declared in this scopeqxthash.cpp:69: error: ‘MD5Update’ was not declared in this scopeqxthash.cpp:71: error: ‘Md4’ was not declared in this scopeqxthash.cpp:73: error: ‘md4_update’ was not declared in this scopeqxthash.cpp:81: error: ‘QxtHash’ has not been declaredqxthash.cpp:81: error: ‘void operator+=(const QByteArray&)’ must take exactly two argumentsqxthash.cpp:89: error: ‘QxtHash’ has not been declaredqxthash.cpp:91: error: ‘qxt_d’ was not declared in this scopeqxthash.cpp:91: error: ‘Md5’ was not declared in this scopeqxthash.cpp:93: error: ‘MD5Init’ was not declared in this scopeqxthash.cpp:95: error: ‘Md4’ was not declared in this scopeqxthash.cpp:97: error: ‘md4_init’ was not declared in this scopeqxthash.cpp:105: error: ‘QxtHash’ has not been declaredqxthash.cpp:109: error: ‘qxt_d’ was not declared in this scopeqxthash.cpp:109: error: ‘Md5’ was not declared in this scopeqxthash.cpp:112: error: ‘MD5Final’ was not declared in this scopeqxthash.cpp:114: error: ‘Md4’ was not declared in this scopeqxthash.cpp:116: error: ‘MD4_RESULTLEN’ was not declared in this scopeqxthash.cpp:117: error: ‘md4_final’ was not declared in this scopethirdparty/md5.cpp:48: warning: ‘void MD5Init(MD5Context*)’ defined but not usedthirdparty/md5.cpp:64: warning: ‘void MD5Update(MD5Context*, const md5byte*, unsigned int)’ defined but not usedthirdparty/md5.cpp:104: warning: ‘void MD5Final(MD5Context*, md5byte*)’ defined but not usedthirdparty/md4.cpp:161: warning: ‘void md4_init(md4_context*)’ defined but not usedthirdparty/md4.cpp:172: warning: ‘void md4_update(md4_context*, const unsigned char*, size_t)’ defined but not usedthirdparty/md4.cpp:207: warning: ‘void md4_final(md4_context*, unsigned char*)’ defined but not usedmake[1]: *** [.obj/qxthash.o] Error 1make: *** [sub-src-crypto-make_default] Error 2------- FULL LOG -------which: no gmake in (/usr/lib/ccache/bin:/opt/bin:/bin:/usr/bin:/sbin:/usr/sbin:/usr/X11R6/bin:/opt/bin:/opt/mozilla/bin:/opt/qt/bin)checking for qt4	...  [success] checking for openssl	...  [success] checking for fcgi	...  [success] autodetection finished. running qmake.Reading /home/karol/stat/libqxt/tools/doqsy/doqsy.proReading /home/karol/stat/libqxt/src/core/core.proReading /home/karol/stat/libqxt/src/gui/gui.proReading /home/karol/stat/libqxt/src/designer/designer.proReading /home/karol/stat/libqxt/src/network/network.proReading /home/karol/stat/libqxt/src/sql/sql.proReading /home/karol/stat/libqxt/src/web/web.proReading /home/karol/stat/libqxt/src/crypto/crypto.proconfigure finished. run /usr/bin/make now.cd tools/doqsy/ && make -f Makefile make[1]: Entering directory `/home/karol/stat/libqxt/tools/doqsy'g++ -c -pipe -march=i686 -mtune=generic -O2 -pipe -Wall -W -D_REENTRANT -DQT_NO_DEBUG -DQT_XML_LIB -DQT_GUI_LIB -DQT_CORE_LIB -DQT_SHARED -I/usr/share/qt4/mkspecs/linux-g++ -I. -I/usr/include/QtCore -I/usr/include/QtCore -I/usr/include/QtGui -I/usr/include/QtGui -I/usr/include/QtXml -I/usr/include/QtXml -I/usr/include -I. -I../../deploy/include/QxtWeb -I../../src/web -I../../src/core -I. -I. -o main.o main.cppg++ -c -pipe -march=i686 -mtune=generic -O2 -pipe -Wall -W -D_REENTRANT -DQT_NO_DEBUG -DQT_XML_LIB -DQT_GUI_LIB -DQT_CORE_LIB -DQT_SHARED -I/usr/share/qt4/mkspecs/linux-g++ -I. -I/usr/include/QtCore -I/usr/include/QtCore -I/usr/include/QtGui -I/usr/include/QtGui -I/usr/include/QtXml -I/usr/include/QtXml -I/usr/include -I. -I../../deploy/include/QxtWeb -I../../src/web -I../../src/core -I. -I. -o qxthtmltemplate.o ../../src/web/qxthtmltemplate.cppg++ -Wl,-rpath,/usr/lib -o doqsy main.o qxthtmltemplate.o    -L/usr/lib -lQtXml -L/usr/lib -pthread -pthread -lQtGui -L/usr/X11R6/lib -laudio -lXt -lpng -lSM -lICE -pthread -pthread -lXi -lXrender -lXrandr -lXfixes -lXcursor -lXinerama -lfreetype -lfontconfig -lXext -lX11 -lQtCore -lz -lm -pthread -lgthread-2.0 -lrt -lglib-2.0 -ldl -lpthreadmake[1]: Leaving directory `/home/karol/stat/libqxt/tools/doqsy'cd src/core/ && make -f Makefile make[1]: Entering directory `/home/karol/stat/libqxt/src/core'compiling qxtcsvmodel.cppcompiling qxtdaemon.cppcompiling qxterror.cppcompiling qxtfifo.cppcompiling qxtfilelock.cppcompiling qxtfilelock_unix.cppcompiling qxtfilelock_win.cppcompiling qxtjob.cppcompiling qxtlinesocket.cppcompiling qxtmetaobject.cppcompiling qxtnull.cppcompiling qxtpipe.cppcompiling qxtsemaphore.cppcompiling qxtsignalwaiter.cppcompiling qxtslotjob.cppcompiling qxtstdio.cppcompiling qxtstdstreambufdevice.cppmoc qxtboundfunction.hcompiling .moc/moc_qxtboundfunction.cppmoc qxtcsvmodel.hcompiling .moc/moc_qxtcsvmodel.cppmoc qxtdaemon.hcompiling .moc/moc_qxtdaemon.cppmoc qxtfifo.hcompiling .moc/moc_qxtfifo.cppmoc qxtfilelock.hcompiling .moc/moc_qxtfilelock.cppmoc qxtjob.hcompiling .moc/moc_qxtjob.cppmoc qxtjob_p.hcompiling .moc/moc_qxtjob_p.cppmoc qxtlinesocket.hcompiling .moc/moc_qxtlinesocket.cppmoc qxtlinesocket_p.hcompiling .moc/moc_qxtlinesocket_p.cppmoc qxtnamespace.hcompiling .moc/moc_qxtnamespace.cppmoc qxtpipe.hcompiling .moc/moc_qxtpipe.cppmoc qxtsignalwaiter.hcompiling .moc/moc_qxtsignalwaiter.cppmoc qxtslotjob.hcompiling .moc/moc_qxtslotjob.cppmoc qxtstdio.hcompiling .moc/moc_qxtstdio.cppmoc qxtstdstreambufdevice.hcompiling .moc/moc_qxtstdstreambufdevice.cpprm -f libQxtCore.so.0.3.0 libQxtCore.so libQxtCore.so.0 libQxtCore.so.0.3linking ../../deploy/libs/libQxtCore.so.0.3.0ln -s libQxtCore.so.0.3.0 libQxtCore.soln -s libQxtCore.so.0.3.0 libQxtCore.so.0ln -s libQxtCore.so.0.3.0 libQxtCore.so.0.3rm -f ../../deploy/libs/libQxtCore.so.0.3.0rm -f ../../deploy/libs/libQxtCore.sorm -f ../../deploy/libs/libQxtCore.so.0rm -f ../../deploy/libs/libQxtCore.so.0.3mv -f libQxtCore.so.0.3.0 libQxtCore.so libQxtCore.so.0 libQxtCore.so.0.3 ../../deploy/libs/make[1]: Leaving directory `/home/karol/stat/libqxt/src/core'cd src/gui/ && make -f Makefile make[1]: Entering directory `/home/karol/stat/libqxt/src/gui'compiling qxtapplication.cppcompiling qxtcheckcombobox.cppcompiling qxtconfigdialog.cppcompiling qxtconfirmationmessage.cppcompiling qxtdockwidget.cppcompiling qxtgroupbox.cppcompiling qxtheaderview.cppcompiling qxtitemdelegate.cppcompiling qxtlabel.cppcompiling qxtlistwidget.cppcompiling qxtlistwidgetitem.cppcompiling qxtprogresslabel.cppcompiling qxtproxystyle.cppcompiling qxtpushbutton.cppcompiling qxtspanslider.cppcompiling qxtstars.cppcompiling qxtstringspinbox.cppcompiling qxtstringvalidator.cppcompiling qxttablewidget.cppcompiling qxttablewidgetitem.cppcompiling qxttabwidget.cppcompiling qxttooltip.cppcompiling qxttreewidget.cppcompiling qxttreewidgetitem.cppcompiling qxtwindowsystem.cppcompiling qxtapplication_x11.cppcompiling qxtwindowsystem_x11.cppmoc qxtapplication.hcompiling .moc/moc_qxtapplication.cppmoc qxtcheckcombobox.hcompiling .moc/moc_qxtcheckcombobox.cppmoc qxtcheckcombobox_p.hcompiling .moc/moc_qxtcheckcombobox_p.cppmoc qxtconfigdialog.hcompiling .moc/moc_qxtconfigdialog.cppmoc qxtconfigdialog_p.hcompiling .moc/moc_qxtconfigdialog_p.cppmoc qxtconfirmationmessage.hcompiling .moc/moc_qxtconfirmationmessage.cppmoc qxtdockwidget.hcompiling .moc/moc_qxtdockwidget.cppmoc qxtgroupbox.hcompiling .moc/moc_qxtgroupbox.cppmoc qxtheaderview.hqxtheaderview.h:0: Warning: No relevant classes found. No output generated.compiling .moc/moc_qxtheaderview.cppmoc qxtitemdelegate.hcompiling .moc/moc_qxtitemdelegate.cppmoc qxtitemdelegate_p.hcompiling .moc/moc_qxtitemdelegate_p.cppmoc qxtlabel.hcompiling .moc/moc_qxtlabel.cppmoc qxtlistwidget.hcompiling .moc/moc_qxtlistwidget.cppmoc qxtlistwidget_p.hcompiling .moc/moc_qxtlistwidget_p.cppmoc qxtprogresslabel.hcompiling .moc/moc_qxtprogresslabel.cppmoc qxtpushbutton.hcompiling .moc/moc_qxtpushbutton.cppmoc qxtspanslider.hcompiling .moc/moc_qxtspanslider.cppmoc qxtspanslider_p.hcompiling .moc/moc_qxtspanslider_p.cppmoc qxtstars.hcompiling .moc/moc_qxtstars.cppmoc qxtstringspinbox.hcompiling .moc/moc_qxtstringspinbox.cppmoc qxtstringvalidator.hcompiling .moc/moc_qxtstringvalidator.cppmoc qxttablewidget.hcompiling .moc/moc_qxttablewidget.cppmoc qxttablewidget_p.hcompiling .moc/moc_qxttablewidget_p.cppmoc qxttabwidget.hcompiling .moc/moc_qxttabwidget.cppmoc qxttooltip_p.hcompiling .moc/moc_qxttooltip_p.cppmoc qxttreewidget.hcompiling .moc/moc_qxttreewidget.cppmoc qxttreewidget_p.hcompiling .moc/moc_qxttreewidget_p.cpprm -f libQxtGui.so.0.3.0 libQxtGui.so libQxtGui.so.0 libQxtGui.so.0.3linking ../../deploy/libs/libQxtGui.so.0.3.0ln -s libQxtGui.so.0.3.0 libQxtGui.soln -s libQxtGui.so.0.3.0 libQxtGui.so.0ln -s libQxtGui.so.0.3.0 libQxtGui.so.0.3rm -f ../../deploy/libs/libQxtGui.so.0.3.0rm -f ../../deploy/libs/libQxtGui.sorm -f ../../deploy/libs/libQxtGui.so.0rm -f ../../deploy/libs/libQxtGui.so.0.3mv -f libQxtGui.so.0.3.0 libQxtGui.so libQxtGui.so.0 libQxtGui.so.0.3 ../../deploy/libs/make[1]: Leaving directory `/home/karol/stat/libqxt/src/gui'cd src/designer/ && make -f Makefile make[1]: Entering directory `/home/karol/stat/libqxt/src/designer'compiling qxtcheckcomboboxplugin.cppcompiling qxtdesignerplugin.cppcompiling qxtdesignerplugins.cppcompiling qxtgroupboxplugin.cppcompiling qxtlabelplugin.cppcompiling qxtlistwidgetplugin.cppcompiling qxtprogresslabelplugin.cppcompiling qxtpushbuttonplugin.cppcompiling qxtspansliderplugin.cppcompiling qxtstarsplugin.cppcompiling qxtstringspinboxplugin.cppcompiling qxttablewidgetplugin.cppcompiling qxttreewidgetplugin.cppmoc qxtcheckcomboboxplugin.hcompiling .moc/moc_qxtcheckcomboboxplugin.cppmoc qxtdesignerplugins.hcompiling .moc/moc_qxtdesignerplugins.cppmoc qxtgroupboxplugin.hcompiling .moc/moc_qxtgroupboxplugin.cppmoc qxtlabelplugin.hcompiling .moc/moc_qxtlabelplugin.cppmoc qxtlistwidgetplugin.hcompiling .moc/moc_qxtlistwidgetplugin.cppmoc qxtprogresslabelplugin.hcompiling .moc/moc_qxtprogresslabelplugin.cppmoc qxtpushbuttonplugin.hcompiling .moc/moc_qxtpushbuttonplugin.cppmoc qxtspansliderplugin.hcompiling .moc/moc_qxtspansliderplugin.cppmoc qxtstarsplugin.hcompiling .moc/moc_qxtstarsplugin.cppmoc qxtstringspinboxplugin.hcompiling .moc/moc_qxtstringspinboxplugin.cppmoc qxttablewidgetplugin.hcompiling .moc/moc_qxttablewidgetplugin.cppmoc qxttreewidgetplugin.hcompiling .moc/moc_qxttreewidgetplugin.cpprcc resources.qrccompiling qrc_resources.cpprm -f libQxtDesignerPlugins.solinking ../../deploy/libs/libQxtDesignerPlugins.somv -f libQxtDesignerPlugins.so ../../deploy/libs/make[1]: Leaving directory `/home/karol/stat/libqxt/src/designer'cd src/network/ && make -f Makefile make[1]: Entering directory `/home/karol/stat/libqxt/src/network'compiling qxtrpcpeer.cppmoc qxtrpcpeer.hcompiling .moc/moc_qxtrpcpeer.cpprm -f libQxtNetwork.so.0.3.0 libQxtNetwork.so libQxtNetwork.so.0 libQxtNetwork.so.0.3linking ../../deploy/libs/libQxtNetwork.so.0.3.0ln -s libQxtNetwork.so.0.3.0 libQxtNetwork.soln -s libQxtNetwork.so.0.3.0 libQxtNetwork.so.0ln -s libQxtNetwork.so.0.3.0 libQxtNetwork.so.0.3rm -f ../../deploy/libs/libQxtNetwork.so.0.3.0rm -f ../../deploy/libs/libQxtNetwork.sorm -f ../../deploy/libs/libQxtNetwork.so.0rm -f ../../deploy/libs/libQxtNetwork.so.0.3mv -f libQxtNetwork.so.0.3.0 libQxtNetwork.so libQxtNetwork.so.0 libQxtNetwork.so.0.3 ../../deploy/libs/make[1]: Leaving directory `/home/karol/stat/libqxt/src/network'cd src/sql/ && make -f Makefile make[1]: Entering directory `/home/karol/stat/libqxt/src/sql'compiling qxtsqlpackage.cppcompiling qxtsqlpackagemodel.cppmoc qxtsqlpackage.hcompiling .moc/moc_qxtsqlpackage.cpprm -f libQxtSql.so.0.3.0 libQxtSql.so libQxtSql.so.0 libQxtSql.so.0.3linking ../../deploy/libs/libQxtSql.so.0.3.0ln -s libQxtSql.so.0.3.0 libQxtSql.soln -s libQxtSql.so.0.3.0 libQxtSql.so.0ln -s libQxtSql.so.0.3.0 libQxtSql.so.0.3rm -f ../../deploy/libs/libQxtSql.so.0.3.0rm -f ../../deploy/libs/libQxtSql.sorm -f ../../deploy/libs/libQxtSql.so.0rm -f ../../deploy/libs/libQxtSql.so.0.3mv -f libQxtSql.so.0.3.0 libQxtSql.so libQxtSql.so.0 libQxtSql.so.0.3 ../../deploy/libs/make[1]: Leaving directory `/home/karol/stat/libqxt/src/sql'cd src/web/ && make -f Makefile make[1]: Entering directory `/home/karol/stat/libqxt/src/web'compiling qxthtmltemplate.cppcompiling qxtmail.cppcompiling qxtsendmail.cppcompiling qxtwebcontroller.cppcompiling qxtwebcore.cppcompiling qxtwebhttpconnector.cppcompiling qxtwebscgiconnector.cppcompiling qxtwebfcgiconnector.cppmoc qxtabstractwebconnector.hcompiling .moc/moc_qxtabstractwebconnector.cppmoc qxtwebcontroller.hcompiling .moc/moc_qxtwebcontroller.cppmoc qxtwebcore.hcompiling .moc/moc_qxtwebcore.cppmoc qxtwebcore_p.hcompiling .moc/moc_qxtwebcore_p.cppmoc qxtwebhttpconnector.hcompiling .moc/moc_qxtwebhttpconnector.cppmoc qxtwebhttpconnector_p.hcompiling .moc/moc_qxtwebhttpconnector_p.cppmoc qxtwebscgiconnector.hcompiling .moc/moc_qxtwebscgiconnector.cppmoc qxtwebscgiconnector_p.hcompiling .moc/moc_qxtwebscgiconnector_p.cppmoc qxtwebstatelessconnector.hcompiling .moc/moc_qxtwebstatelessconnector.cppmoc qxtwebfcgiconnector.hcompiling .moc/moc_qxtwebfcgiconnector.cppmoc qxtwebfcgiconnector_p.hcompiling .moc/moc_qxtwebfcgiconnector_p.cpprm -f libQxtWeb.so.0.3.0 libQxtWeb.so libQxtWeb.so.0 libQxtWeb.so.0.3linking ../../deploy/libs/libQxtWeb.so.0.3.0ln -s libQxtWeb.so.0.3.0 libQxtWeb.soln -s libQxtWeb.so.0.3.0 libQxtWeb.so.0ln -s libQxtWeb.so.0.3.0 libQxtWeb.so.0.3rm -f ../../deploy/libs/libQxtWeb.so.0.3.0rm -f ../../deploy/libs/libQxtWeb.sorm -f ../../deploy/libs/libQxtWeb.so.0rm -f ../../deploy/libs/libQxtWeb.so.0.3mv -f libQxtWeb.so.0.3.0 libQxtWeb.so libQxtWeb.so.0 libQxtWeb.so.0.3 ../../deploy/libs/make[1]: Leaving directory `/home/karol/stat/libqxt/src/web'cd src/crypto/ && make -f Makefile make[1]: Entering directory `/home/karol/stat/libqxt/src/crypto'compiling qxthash.cppIn file included from qxthash.cpp:25:qxthash.h:29:23: error: qxtglobal.h: No such file or directoryqxthash.h:30:22: error: qxtpimpl.h: No such file or directoryIn file included from qxthash.cpp:26:qxthash_p.h:1:17: error: md5.h: No such file or directoryqxthash_p.h:2:17: error: md4.h: No such file or directoryIn file included from qxthash.cpp:25:qxthash.h:33: error: function definition does not declare parametersIn file included from qxthash.cpp:26:qxthash_p.h:3: error: expected template-name before ‘<’ tokenqxthash_p.h:3: error: expected `{' before ‘<’ tokenqxthash_p.h:3: error: expected unqualified-id before ‘<’ tokenqxthash.cpp:43: error: ‘QxtHash’ has not been declaredqxthash.cpp:43: error: expected constructor, destructor, or type conversion before ‘(’ tokenqxthash.cpp:53: error: ‘QxtHash’ has not been declaredqxthash.cpp:53: error: expected constructor, destructor, or type conversion before ‘(’ tokenqxthash.cpp:65: error: ‘QxtHash’ has not been declaredqxthash.cpp: In function ‘void append(const QByteArray&)’:qxthash.cpp:67: error: ‘qxt_d’ was not declared in this scopeqxthash.cpp:67: error: ‘Md5’ was not declared in this scopeqxthash.cpp:69: error: ‘MD5Update’ was not declared in this scopeqxthash.cpp:71: error: ‘Md4’ was not declared in this scopeqxthash.cpp:73: error: ‘md4_update’ was not declared in this scopeqxthash.cpp: At global scope:qxthash.cpp:81: error: ‘QxtHash’ has not been declaredqxthash.cpp:81: error: ‘void operator+=(const QByteArray&)’ must take exactly two argumentsqxthash.cpp:89: error: ‘QxtHash’ has not been declaredqxthash.cpp: In function ‘void reset()’:qxthash.cpp:91: error: ‘qxt_d’ was not declared in this scopeqxthash.cpp:91: error: ‘Md5’ was not declared in this scopeqxthash.cpp:93: error: ‘MD5Init’ was not declared in this scopeqxthash.cpp:95: error: ‘Md4’ was not declared in this scopeqxthash.cpp:97: error: ‘md4_init’ was not declared in this scopeqxthash.cpp: At global scope:qxthash.cpp:105: error: ‘QxtHash’ has not been declaredqxthash.cpp: In function ‘QByteArray hash()’:qxthash.cpp:109: error: ‘qxt_d’ was not declared in this scopeqxthash.cpp:109: error: ‘Md5’ was not declared in this scopeqxthash.cpp:112: error: ‘MD5Final’ was not declared in this scopeqxthash.cpp:114: error: ‘Md4’ was not declared in this scopeqxthash.cpp:116: error: ‘MD4_RESULTLEN’ was not declared in this scopeqxthash.cpp:117: error: ‘md4_final’ was not declared in this scopeIn file included from qxthash.cpp:126:thirdparty/md5.cpp: At global scope:thirdparty/md5.cpp:48: warning: ‘void MD5Init(MD5Context*)’ defined but not usedthirdparty/md5.cpp:64: warning: ‘void MD5Update(MD5Context*, const md5byte*, unsigned int)’ defined but not usedthirdparty/md5.cpp:104: warning: ‘void MD5Final(MD5Context*, md5byte*)’ defined but not usedthirdparty/md4.cpp:161: warning: ‘void md4_init(md4_context*)’ defined but not usedthirdparty/md4.cpp:172: warning: ‘void md4_update(md4_context*, const unsigned char*, size_t)’ defined but not usedthirdparty/md4.cpp:207: warning: ‘void md4_final(md4_context*, unsigned char*)’ defined but not usedmake[1]: *** [.obj/qxthash.o] Error 1make[1]: Leaving directory `/home/karol/stat/libqxt/src/crypto'make: *** [sub-src-crypto-make_default] Error 2