main.c: In function main:
main.c:521: error: GNOME_PARAM_GOPTION_CONTEXT undeclared (first use in this function)
main.c:521: error: (Each undeclared identifier is reported only once
main.c:521: error: for each function it appears in.)
make[3]: *** [main.o] Error 1
make[3]: Leaving directory `/home/atul/cvs/gnome2/evolution/shell'
make[2]: *** [all] Error 2
make[2]: Leaving directory `/home/atul/cvs/gnome2/evolution/shell'
make[1]: *** [all-recursive] Error 1
make[1]: Leaving directory `/home/atul/cvs/gnome2/evolution'
make: *** [all] Error 2
*** error during stage build of evolution: Error running make *** [1/1]
[1] rerun stage build
[2] ignore error and continue to install
[3] give up on module
[4] start shell
[5] go to stage force_checkout
[6] go to stage configure
choice: