All pastes #815869 Raw Edit

Unnamed

public text v1 · immutable
·published 2007-12-14 13:29 UTC
rendered paste body
Error while trying to emerge x11-drivers/xf86-input-dynapro-1.1.1:

make[2]: *** [xf86Dyna.lo] Error 1
make[1]: *** [all-recursive] Error 1
make: *** [all] Error 2
 *
 * ERROR: x11-drivers/xf86-input-dynapro-1.1.1 failed.
 * Call stack:
 *               ebuild.sh, line   46:  Called src_compile
 *             environment, line 2903:  Called x-modular_src_compile
 *             environment, line 3630:  Called x-modular_src_make
 *             environment, line 3664:  Called die
 * The specific snippet of code:
 *       emake || diefunc "$FUNCNAME" "$LINENO" "$?" "emake failed"
 *  The die message:
 *   emake failed
 *
 * If you need support, post the topmost build error, and the call stack if relevant.
 * A complete build log is located at '/var/tmp/portage/x11-drivers/xf86-input-dynapro-1.1.1/temp/build.log'.
 * The ebuild environment file is located at '/var/tmp/portage/x11-drivers/xf86-input-dynapro-1.1.1/temp/environment'.
 *

 * Messages for package x11-drivers/xf86-input-dynapro-1.1.1:

 *
 * ERROR: x11-drivers/xf86-input-dynapro-1.1.1 failed.
 * Call stack:
 *               ebuild.sh, line   46:  Called src_compile
 *             environment, line 2903:  Called x-modular_src_compile
 *             environment, line 3630:  Called x-modular_src_make
 *             environment, line 3664:  Called die
 * The specific snippet of code:
 *       emake || diefunc "$FUNCNAME" "$LINENO" "$?" "emake failed"
 *  The die message:
 *   emake failed
 *
 * If you need support, post the topmost build error, and the call stack if relevant.
 * A complete build log is located at '/var/tmp/portage/x11-drivers/xf86-input-dynapro-1.1.1/temp/build.log'.
 * The ebuild environment file is located at '/var/tmp/portage/x11-drivers/xf86-input-dynapro-1.1.1/temp/environment'.
 *

While trying to emerge sys-libs/pam-0.99.9.0:

>>> Merging sys-libs/pam-0.99.9.0 to /
 *
 * Your current setup is using one or more of the following modules,
 * that are not built or supported anymore:
 * pam_pwdb, pam_radius, pam_timestamp, pam_console
 * If you are in real need for these modules, please contact the maintainers
 * of PAM through http://bugs.gentoo.org/ providing information about its
 * use cases.
 * Please also make sure to read the PAM Upgrade guide at the following URL:
 *   http://www.gentoo.org/proj/en/base/pam/upgrade-0.99.xml
 *
 *
 * ERROR: sys-libs/pam-0.99.9.0 failed.
 * Call stack:
 *               ebuild.sh, line   46:  Called pkg_preinst
 *             environment, line 2559:  Called die
 * The specific snippet of code:
 *       check_old_modules || diefunc "$FUNCNAME" "$LINENO" "$?" "deprecated PAM modules still used";
 *  The die message:
 *   deprecated PAM modules still used
 *
 * If you need support, post the topmost build error, and the call stack if relevant.
 * A complete build log is located at '/var/tmp/portage/sys-libs/pam-0.99.9.0/temp/build.log'.
 * The ebuild environment file is located at '/var/tmp/portage/sys-libs/pam-0.99.9.0/temp/environment'.
 *
!!! FAILED preinst: 1

 * Messages for package sys-libs/pam-0.99.9.0:

 *
 * Your current setup is using one or more of the following modules,
 * that are not built or supported anymore:
 * pam_pwdb, pam_radius, pam_timestamp, pam_console
 * If you are in real need for these modules, please contact the maintainers
 * of PAM through http://bugs.gentoo.org/ providing information about its
 * use cases.
 * Please also make sure to read the PAM Upgrade guide at the following URL:
 *   http://www.gentoo.org/proj/en/base/pam/upgrade-0.99.xml
 *
 *
 * Your current setup is using one or more of the following modules,
 * that are not built or supported anymore:
 * pam_pwdb, pam_radius, pam_timestamp, pam_console
 * If you are in real need for these modules, please contact the maintainers
 * of PAM through http://bugs.gentoo.org/ providing information about its
 * use cases.
 * Please also make sure to read the PAM Upgrade guide at the following URL:
 *   http://www.gentoo.org/proj/en/base/pam/upgrade-0.99.xml
 *
 *
 * ERROR: sys-libs/pam-0.99.9.0 failed.
 * Call stack:
 *               ebuild.sh, line   46:  Called pkg_preinst
 *             environment, line 2559:  Called die
 * The specific snippet of code:
 *       check_old_modules || diefunc "$FUNCNAME" "$LINENO" "$?" "deprecated PAM modules still used";
 *  The die message:
 *   deprecated PAM modules still used
 *
 * If you need support, post the topmost build error, and the call stack if relevant.
 * A complete build log is located at '/var/tmp/portage/sys-libs/pam-0.99.9.0/temp/build.log'.
 * The ebuild environment file is located at '/var/tmp/portage/sys-libs/pam-0.99.9.0/temp/environment'.
 *

While trying to emerge dev-python/pyvorbis-1.4-r3:

>>> Compiling source in /var/tmp/portage/dev-python/pyvorbis-1.4-r3/work/pyvorbis-1.4 ...
Checking for Ogg ... success
Checking for Vorbis ... success
Wrote Setup file
You must have the Ogg Python bindings
installed in order to build and install
these bindings. Import of ogg._ogg failed.
 *
 * ERROR: dev-python/pyvorbis-1.4-r3 failed.
 * Call stack:
 *               ebuild.sh, line   46:  Called src_compile
 *             environment, line 2312:  Called distutils_src_compile
 *             environment, line  694:  Called die
 * The specific snippet of code:
 *       ${python} setup.py build "$@" || diefunc "$FUNCNAME" "$LINENO" "$?" "compilation failed"
 *  The die message:
 *   compilation failed
 *
 * If you need support, post the topmost build error, and the call stack if relevant.
 * A complete build log is located at '/var/tmp/portage/dev-python/pyvorbis-1.4-r3/temp/build.log'.
 * The ebuild environment file is located at '/var/tmp/portage/dev-python/pyvorbis-1.4-r3/temp/environment'.
 *

 * Messages for package dev-python/pyvorbis-1.4-r3:

 *
 * ERROR: dev-python/pyvorbis-1.4-r3 failed.
 * Call stack:
 *               ebuild.sh, line   46:  Called src_compile
 *             environment, line 2312:  Called distutils_src_compile
 *             environment, line  694:  Called die
 * The specific snippet of code:
 *       ${python} setup.py build "$@" || diefunc "$FUNCNAME" "$LINENO" "$?" "compilation failed"
 *  The die message:
 *   compilation failed
 *
 * If you need support, post the topmost build error, and the call stack if relevant.
 * A complete build log is located at '/var/tmp/portage/dev-python/pyvorbis-1.4-r3/temp/build.log'.
 * The ebuild environment file is located at '/var/tmp/portage/dev-python/pyvorbis-1.4-r3/temp/environment'.
 *