rendered paste bodyclude/glib-2.0 -I/opt/gnome/lib/glib-2.0/include -I/opt/gnome/include/orbit-2.0 -I/opt/gnome/include/libbonobo-2.0 -I/opt/gnome/include/gconf/2 -I/opt/gnome/inc lude/gnome-vfs-2.0 -I/opt/gnome/lib/gnome-vfs-2.0/include -I/opt/gnome/include/b onobo-activation-2.0 -I/opt/gnome/include/libgnomeui-2.0 -I/opt/gnome/include/li bgnomecanvas-2.0 -I/opt/gnome/include/gtk-2.0 -I/opt/gnome/include/libbonoboui-2 .0 -I/opt/gnome/include/gnome-keyring-1 -I/opt/gnome/include/pango-1.0 -I/opt/gn ome/lib/gtk-2.0/include -I/opt/gnome/include/atk-1.0 -g -O2 -Wall -Wmissi ng-prototypes -Wno-sign-compare -MT main.o -MD -MP -MF ".deps/main.Tpo" \
-c -o main.o `test -f 'main.c' || echo './'`main.c; \
then mv -f ".deps/main.Tpo" ".deps/main.Po"; \
else rm -f ".deps/main.Tpo"; exit 1; \
fi
main.c: In function main:
main.c:521: error: GNOME_PARAM_GOPTION_CONTEXT undeclared (first use in this f unction)
main.c:521: error: (Each undeclared identifier is reported only once
main.c:521: error: for each function it appears in.)
make[3]: *** [main.o] Error 1
make[3]: Leaving directory `/home/atul/cvs/gnome2/evolution/shell'
make[2]: *** [all] Error 2
rm GNOME_Evolution_Shell.server.in
make[2]: Leaving directory `/home/atul/cvs/gnome2/evolution/shell'
make[1]: *** [all-recursive] Error 1
make[1]: Leaving directory `/home/atul/cvs/gnome2/evolution'
make: *** [all] Error 2
*** error during stage build of evolution: Error running make *** [1/1]
[1] rerun stage build
[2] ignore error and continue to install
[3] give up on module
[4] start shell
[5] go to stage force_checkout
[6] go to stage configure
choice: