rendered paste bodyif /bin/sh ../libtool --tag=CXX --mode=compile g++ -DHAVE_CONFIG_H -I. -I. -I.. -DPLUGINSDIR=\"/usr/local//lib/gnash/plugins\" -I.. -I. -I.. -I../libamf -I../server -I../server/swf -pthread -I/usr/local/gnome2.18.1/include/libxml2 -I/usr/local/gnome2.18.1/include/glib-2.0 -I/usr/local/gnome2.18.1/lib/glib-2.0/include -pthread -I/usr/local/gnome2.18.1/include/gstreamer-0.10 -I/usr/local/gnome2.18.1/include/glib-2.0 -I/usr/local/gnome2.18.1/lib/glib-2.0/include -I/usr/local/gnome2.18.1/include/libxml2 -I/usr/local/include/boost-1_33_1 -O3 -march=pentium4 -pthread -march=pentium4 -W -Wall -Wcast-align -Wcast-qual -Wpointer-arith -Wreturn-type -fvisibility-inlines-hidden -MT libgnashbase_la-rc.lo -MD -MP -MF ".deps/libgnashbase_la-rc.Tpo" -c -o libgnashbase_la-rc.lo `test -f 'rc.cpp' || echo './'`rc.cpp; \
then mv -f ".deps/libgnashbase_la-rc.Tpo" ".deps/libgnashbase_la-rc.Plo"; else rm -f ".deps/libgnashbase_la-rc.Tpo"; exit 1; fi
g++ -DHAVE_CONFIG_H -I. -I. -I.. -DPLUGINSDIR=\"/usr/local//lib/gnash/plugins\" -I.. -I. -I.. -I../libamf -I../server -I../server/swf -pthread -I/usr/local/gnome2.18.1/include/libxml2 -I/usr/local/gnome2.18.1/include/glib-2.0 -I/usr/local/gnome2.18.1/lib/glib-2.0/include -pthread -I/usr/local/gnome2.18.1/include/gstreamer-0.10 -I/usr/local/gnome2.18.1/include/glib-2.0 -I/usr/local/gnome2.18.1/lib/glib-2.0/include -I/usr/local/gnome2.18.1/include/libxml2 -I/usr/local/include/boost-1_33_1 -O3 -march=pentium4 -pthread -march=pentium4 -W -Wall -Wcast-align -Wcast-qual -Wpointer-arith -Wreturn-type -fvisibility-inlines-hidden -MT libgnashbase_la-rc.lo -MD -MP -MF .deps/libgnashbase_la-rc.Tpo -c rc.cpp -fPIC -DPIC -o .libs/libgnashbase_la-rc.o
rc.cpp: In constructor 'gnash::RcInitFile::RcInitFile()':
rc.cpp:67: error: 'DEFAULT_FLASH_PLATFORM_ID' was not declared in this scope
rc.cpp:72: error: expected `)' before 'DEFAULT_FLASH_SYSTEM_OS'
make[2]: *** [libgnashbase_la-rc.lo] Error 1
make[2]: Leaving directory `/home/edman007/downloads/gnash/libbase'
make[1]: *** [all-recursive] Error 1
make[1]: Leaving directory `/home/edman007/downloads/gnash'
make: *** [all] Error 2