x@diablo:~/Desktop/x[c]$ scripts/compile-prelude
In file included from prelude/prelude.h:9:
prelude/using.hpp:2:47: error: boost/preprocessor/seq/for_each.hpp: No such file or directory
In file included from prelude/prelude.h:10:
prelude/range_printing.hpp:8:27: error: boost/range.hpp: No such file or directory
prelude/range_printing.hpp:9:41: error: boost/type_traits/is_same.hpp: No such file or directory
prelude/range_printing.hpp:10:39: error: boost/utility/enable_if.hpp: No such file or directory
In file included from prelude/prelude.h:11:
prelude/type_strings.hpp:22:32: error: boost/shared_ptr.hpp: No such file or directory
prelude/type_strings.hpp:23:34: error: boost/lexical_cast.hpp: No such file or directory
prelude/type_strings.hpp:24:30: error: boost/optional.hpp: No such file or directory
prelude/type_strings.hpp:25:29: error: boost/utility.hpp: No such file or directory
prelude/type_strings.hpp:26:27: error: boost/array.hpp: No such file or directory
prelude/type_strings.hpp:27:26: error: boost/bind.hpp: No such file or directory
In file included from prelude/type_strings.hpp:31,
from prelude/prelude.h:11:
prelude/ScopeGuard.hpp:5:30: error: boost/function.hpp: No such file or directory
prelude/ScopeGuard.hpp:6:33: error: boost/noncopyable.hpp: No such file or directory
In file included from prelude/prelude.h:14:
prelude/lvalue_rvalue.hpp:31:44: error: boost/type_traits/is_const.hpp: No such file or directory
prelude/prelude.h:87:29: error: boost/version.hpp: No such file or directory
prelude/prelude.h:88:25: error: boost/any.hpp: No such file or directory
prelude/prelude.h:90:28: error: boost/assert.hpp: No such file or directory
prelude/prelude.h:91:28: error: boost/assign.hpp: No such file or directory
prelude/prelude.h:93:36: error: boost/checked_delete.hpp: No such file or directory
prelude/prelude.h:94:28: error: boost/format.hpp: No such file or directory
prelude/prelude.h:95:35: error: boost/implicit_cast.hpp: No such file or directory
prelude/prelude.h:96:29: error: boost/integer.hpp: No such file or directory
prelude/prelude.h:97:36: error: boost/integer_traits.hpp: No such file or directory
prelude/prelude.h:98:39: error: boost/iterator_adaptors.hpp: No such file or directory
prelude/prelude.h:100:33: error: boost/multi_array.hpp: No such file or directory
prelude/prelude.h:101:32: error: boost/next_prior.hpp: No such file or directory
prelude/prelude.h:105:30: error: boost/rational.hpp: No such file or directory
prelude/prelude.h:106:25: error: boost/ref.hpp: No such file or directory
prelude/prelude.h:107:34: error: boost/scoped_array.hpp: No such file or directory
prelude/prelude.h:108:32: error: boost/scoped_ptr.hpp: No such file or directory
prelude/prelude.h:109:34: error: boost/shared_array.hpp: No such file or directory
prelude/prelude.h:111:31: error: boost/smart_ptr.hpp: No such file or directory
prelude/prelude.h:112:31: error: boost/tokenizer.hpp: No such file or directory
prelude/prelude.h:114:29: error: boost/variant.hpp: No such file or directory
prelude/range_printing.hpp: In function ‘void print_range(std::basic_ostream<_CharT, _Traits>&, const Range&)’:
prelude/range_printing.hpp:51: error: ‘boost’ has not been declared
compilation terminated due to -Wfatal-errors.
chmod: cannot access `rt/prelude.h.gch': No such file or directory
x@diablo:~/Desktop/x[c]$ scripts/compile-prelude
In file included from prelude/prelude.h:9:
prelude/using.hpp:2:47: error: boost/preprocessor/seq/for_each.hpp: No such file or directory
In file included from prelude/prelude.h:10:
prelude/range_printing.hpp:8:27: error: boost/range.hpp: No such file or directory
prelude/range_printing.hpp:9:41: error: boost/type_traits/is_same.hpp: No such file or directory
prelude/range_printing.hpp:10:39: error: boost/utility/enable_if.hpp: No such file or directory
In file included from prelude/prelude.h:11:
prelude/type_strings.hpp:22:32: error: boost/shared_ptr.hpp: No such file or directory
prelude/type_strings.hpp:23:34: error: boost/lexical_cast.hpp: No such file or directory
prelude/type_strings.hpp:24:30: error: boost/optional.hpp: No such file or directory
prelude/type_strings.hpp:25:29: error: boost/utility.hpp: No such file or directory
prelude/type_strings.hpp:26:27: error: boost/array.hpp: No such file or directory
prelude/type_strings.hpp:27:26: error: boost/bind.hpp: No such file or directory
In file included from prelude/type_strings.hpp:31,
from prelude/prelude.h:11:
prelude/ScopeGuard.hpp:5:30: error: boost/function.hpp: No such file or directory
prelude/ScopeGuard.hpp:6:33: error: boost/noncopyable.hpp: No such file or directory
In file included from prelude/prelude.h:14:
prelude/lvalue_rvalue.hpp:31:44: error: boost/type_traits/is_const.hpp: No such file or directory
prelude/prelude.h:87:29: error: boost/version.hpp: No such file or directory
prelude/prelude.h:88:25: error: boost/any.hpp: No such file or directory
prelude/prelude.h:90:28: error: boost/assert.hpp: No such file or directory
prelude/prelude.h:91:28: error: boost/assign.hpp: No such file or directory
prelude/prelude.h:93:36: error: boost/checked_delete.hpp: No such file or directory
prelude/prelude.h:94:28: error: boost/format.hpp: No such file or directory
prelude/prelude.h:95:35: error: boost/implicit_cast.hpp: No such file or directory
prelude/prelude.h:96:29: error: boost/integer.hpp: No such file or directory
prelude/prelude.h:97:36: error: boost/integer_traits.hpp: No such file or directory
prelude/prelude.h:98:39: error: boost/iterator_adaptors.hpp: No such file or directory
prelude/prelude.h:100:33: error: boost/multi_array.hpp: No such file or directory
prelude/prelude.h:101:32: error: boost/next_prior.hpp: No such file or directory
prelude/prelude.h:105:30: error: boost/rational.hpp: No such file or directory
prelude/prelude.h:106:25: error: boost/ref.hpp: No such file or directory
prelude/prelude.h:107:34: error: boost/scoped_array.hpp: No such file or directory
prelude/prelude.h:108:32: error: boost/scoped_ptr.hpp: No such file or directory
prelude/prelude.h:109:34: error: boost/shared_array.hpp: No such file or directory
prelude/prelude.h:111:31: error: boost/smart_ptr.hpp: No such file or directory
prelude/prelude.h:112:31: error: boost/tokenizer.hpp: No such file or directory
prelude/prelude.h:114:29: error: boost/variant.hpp: No such file or directory
prelude/range_printing.hpp: In function ‘void print_range(std::basic_ostream<_CharT, _Traits>&, const Range&)’:
prelude/range_printing.hpp:51: error: ‘boost’ has not been declared
compilation terminated due to -Wfatal-errors.
chmod: cannot access `rt/prelude.h.gch': No such file or directory
x@diablo:~/Desktop/x[c]$ scripts/compile-prelude
In file included from prelude/prelude.h:9:
prelude/using.hpp:2:47: error: boost/preprocessor/seq/for_each.hpp: No such file or directory
In file included from prelude/prelude.h:10:
prelude/range_printing.hpp:8:27: error: boost/range.hpp: No such file or directory
prelude/range_printing.hpp:9:41: error: boost/type_traits/is_same.hpp: No such file or directory
prelude/range_printing.hpp:10:39: error: boost/utility/enable_if.hpp: No such file or directory
In file included from prelude/prelude.h:11:
prelude/type_strings.hpp:22:32: error: boost/shared_ptr.hpp: No such file or directory
prelude/type_strings.hpp:23:34: error: boost/lexical_cast.hpp: No such file or directory
prelude/type_strings.hpp:24:30: error: boost/optional.hpp: No such file or directory
prelude/type_strings.hpp:25:29: error: boost/utility.hpp: No such file or directory
prelude/type_strings.hpp:26:27: error: boost/array.hpp: No such file or directory
prelude/type_strings.hpp:27:26: error: boost/bind.hpp: No such file or directory
In file included from prelude/type_strings.hpp:31,
from prelude/prelude.h:11:
prelude/ScopeGuard.hpp:5:30: error: boost/function.hpp: No such file or directory
prelude/ScopeGuard.hpp:6:33: error: boost/noncopyable.hpp: No such file or directory
In file included from prelude/prelude.h:14:
prelude/lvalue_rvalue.hpp:31:44: error: boost/type_traits/is_const.hpp: No such file or directory
prelude/prelude.h:87:29: error: boost/version.hpp: No such file or directory
prelude/prelude.h:88:25: error: boost/any.hpp: No such file or directory
prelude/prelude.h:90:28: error: boost/assert.hpp: No such file or directory
prelude/prelude.h:91:28: error: boost/assign.hpp: No such file or directory
prelude/prelude.h:93:36: error: boost/checked_delete.hpp: No such file or directory
prelude/prelude.h:94:28: error: boost/format.hpp: No such file or directory
prelude/prelude.h:95:35: error: boost/implicit_cast.hpp: No such file or directory
prelude/prelude.h:96:29: error: boost/integer.hpp: No such file or directory
prelude/prelude.h:97:36: error: boost/integer_traits.hpp: No such file or directory
prelude/prelude.h:98:39: error: boost/iterator_adaptors.hpp: No such file or directory
prelude/prelude.h:100:33: error: boost/multi_array.hpp: No such file or directory
prelude/prelude.h:101:32: error: boost/next_prior.hpp: No such file or directory
prelude/prelude.h:105:30: error: boost/rational.hpp: No such file or directory
prelude/prelude.h:106:25: error: boost/ref.hpp: No such file or directory
prelude/prelude.h:107:34: error: boost/scoped_array.hpp: No such file or directory
prelude/prelude.h:108:32: error: boost/scoped_ptr.hpp: No such file or directory
prelude/prelude.h:109:34: error: boost/shared_array.hpp: No such file or directory
prelude/prelude.h:111:31: error: boost/smart_ptr.hpp: No such file or directory
prelude/prelude.h:112:31: error: boost/tokenizer.hpp: No such file or directory
prelude/prelude.h:114:29: error: boost/variant.hpp: No such file or directory
prelude/range_printing.hpp: In function ‘void print_range(std::basic_ostream<_CharT, _Traits>&, const Range&)’:
prelude/range_printing.hpp:51: error: ‘boost’ has not been declared
compilation terminated due to -Wfatal-errors.
chmod: cannot access `rt/prelude.h.gch': No such file or directory
x@diablo:~/Desktop/x[c]$ scripts/compile-prelude
In file included from prelude/prelude.h:9:
prelude/using.hpp:2:47: error: boost/preprocessor/seq/for_each.hpp: No such file or directory
In file included from prelude/prelude.h:10:
prelude/range_printing.hpp:8:27: error: boost/range.hpp: No such file or directory
prelude/range_printing.hpp:9:41: error: boost/type_traits/is_same.hpp: No such file or directory
prelude/range_printing.hpp:10:39: error: boost/utility/enable_if.hpp: No such file or directory
In file included from prelude/prelude.h:11:
prelude/type_strings.hpp:22:32: error: boost/shared_ptr.hpp: No such file or directory
prelude/type_strings.hpp:23:34: error: boost/lexical_cast.hpp: No such file or directory
prelude/type_strings.hpp:24:30: error: boost/optional.hpp: No such file or directory
prelude/type_strings.hpp:25:29: error: boost/utility.hpp: No such file or directory
prelude/type_strings.hpp:26:27: error: boost/array.hpp: No such file or directory
prelude/type_strings.hpp:27:26: error: boost/bind.hpp: No such file or directory
In file included from prelude/type_strings.hpp:31,
from prelude/prelude.h:11:
prelude/ScopeGuard.hpp:5:30: error: boost/function.hpp: No such file or directory
prelude/ScopeGuard.hpp:6:33: error: boost/noncopyable.hpp: No such file or directory
In file included from prelude/prelude.h:14:
prelude/lvalue_rvalue.hpp:31:44: error: boost/type_traits/is_const.hpp: No such file or directory
prelude/prelude.h:87:29: error: boost/version.hpp: No such file or directory
prelude/prelude.h:88:25: error: boost/any.hpp: No such file or directory
prelude/prelude.h:90:28: error: boost/assert.hpp: No such file or directory
prelude/prelude.h:91:28: error: boost/assign.hpp: No such file or directory
prelude/prelude.h:93:36: error: boost/checked_delete.hpp: No such file or directory
prelude/prelude.h:94:28: error: boost/format.hpp: No such file or directory
prelude/prelude.h:95:35: error: boost/implicit_cast.hpp: No such file or directory
prelude/prelude.h:96:29: error: boost/integer.hpp: No such file or directory
prelude/prelude.h:97:36: error: boost/integer_traits.hpp: No such file or directory
prelude/prelude.h:98:39: error: boost/iterator_adaptors.hpp: No such file or directory
prelude/prelude.h:100:33: error: boost/multi_array.hpp: No such file or directory
prelude/prelude.h:101:32: error: boost/next_prior.hpp: No such file or directory
prelude/prelude.h:105:30: error: boost/rational.hpp: No such file or directory
prelude/prelude.h:106:25: error: boost/ref.hpp: No such file or directory
prelude/prelude.h:107:34: error: boost/scoped_array.hpp: No such file or directory
prelude/prelude.h:108:32: error: boost/scoped_ptr.hpp: No such file or directory
prelude/prelude.h:109:34: error: boost/shared_array.hpp: No such file or directory
prelude/prelude.h:111:31: error: boost/smart_ptr.hpp: No such file or directory
prelude/prelude.h:112:31: error: boost/tokenizer.hpp: No such file or directory
prelude/prelude.h:114:29: error: boost/variant.hpp: No such file or directory
prelude/range_printing.hpp: In function ‘void print_range(std::basic_ostream<_CharT, _Traits>&, const Range&)’:
prelude/range_printing.hpp:51: error: ‘boost’ has not been declared
compilation terminated due to -Wfatal-errors.
chmod: cannot access `rt/prelude.h.gch': No such file or directory
x@diablo:~/Desktop/x[c]$