All pastes #815324 Raw Edit

Unnamed

public text v1 · immutable
·published 2007-12-13 23:28 UTC
rendered paste body
-------------------------------------------------------
 T E S T S
-------------------------------------------------------
Running org.osaf.cosmo.dav.impl.StandardDavRequestTest
Tests run: 3, Failures: 0, Errors: 0, Skipped: 0, Time elapsed: 0.216 sec
Running org.osaf.cosmo.atom.provider.DeleteSubscriptionTest
Tests run: 1, Failures: 0, Errors: 0, Skipped: 0, Time elapsed: 0.397 sec
Running org.osaf.cosmo.eim.schema.message.MessageGeneratorTest
Tests run: 1, Failures: 0, Errors: 0, Skipped: 0, Time elapsed: 0.052 sec
Running org.osaf.cosmo.calendar.data.ExpandRecurringEventsTest
Tests run: 2, Failures: 0, Errors: 0, Skipped: 0, Time elapsed: 0.434 sec
Running org.osaf.cosmo.io.BufferedContentTest
Tests run: 1, Failures: 0, Errors: 0, Skipped: 0, Time elapsed: 0.064 sec
Running org.osaf.cosmo.server.UserPathTest
Tests run: 7, Failures: 0, Errors: 0, Skipped: 0, Time elapsed: 0.005 sec
Running org.osaf.cosmo.dao.hibernate.HibernateContentDaoTest
WARN - LoadContexts.cleanup(108) | fail-safe cleanup (collections) : org.hibernate.engine.loading.CollectionLoadContext@18806f7<rs=org.apache.derby.impl.jdbc.EmbedResultSet40@1fcadd3>
WARN - LoadContexts.cleanup(108) | fail-safe cleanup (collections) : org.hibernate.engine.loading.CollectionLoadContext@1dd40f3<rs=org.apache.derby.impl.jdbc.EmbedResultSet40@104a681>
Tests run: 34, Failures: 0, Errors: 0, Skipped: 0, Time elapsed: 14.479 sec
Running org.osaf.cosmo.cmp.CmpPostTest
Tests run: 5, Failures: 0, Errors: 0, Skipped: 0, Time elapsed: 0.618 sec
Running org.osaf.cosmo.atom.provider.GetPreferencesTest
ERROR - PreferencesProvider.getFeed(185) | Unknown feed generation error: Failure mode
org.osaf.cosmo.atom.generator.GeneratorException: Failure mode
        at org.osaf.cosmo.atom.generator.mock.MockPreferencesFeedGenerator.generateFeed(MockPreferencesFeedGenerator.java:61)
        at org.osaf.cosmo.atom.provider.PreferencesProvider.getFeed(PreferencesProvider.java:180)
        at org.osaf.cosmo.atom.provider.GetPreferencesTest.testGenerationError(GetPreferencesTest.java:47)
        at sun.reflect.NativeMethodAccessorImpl.invoke0(Native Method)
        at sun.reflect.NativeMethodAccessorImpl.invoke(NativeMethodAccessorImpl.java:39)
        at sun.reflect.DelegatingMethodAccessorImpl.invoke(DelegatingMethodAccessorImpl.java:25)
        at java.lang.reflect.Method.invoke(Method.java:597)
        at junit.framework.TestCase.runTest(TestCase.java:154)
        at junit.framework.TestCase.runBare(TestCase.java:127)
        at junit.framework.TestResult$1.protect(TestResult.java:106)
        at junit.framework.TestResult.runProtected(TestResult.java:124)
        at junit.framework.TestResult.run(TestResult.java:109)
        at junit.framework.TestCase.run(TestCase.java:118)
        at junit.framework.TestSuite.runTest(TestSuite.java:208)
        at junit.framework.TestSuite.run(TestSuite.java:203)
        at sun.reflect.NativeMethodAccessorImpl.invoke0(Native Method)
        at sun.reflect.NativeMethodAccessorImpl.invoke(NativeMethodAccessorImpl.java:39)
        at sun.reflect.DelegatingMethodAccessorImpl.invoke(DelegatingMethodAccessorImpl.java:25)
        at java.lang.reflect.Method.invoke(Method.java:597)
        at org.apache.maven.surefire.junit.JUnitTestSet.execute(JUnitTestSet.java:213)
        at org.apache.maven.surefire.suite.AbstractDirectoryTestSuite.executeTestSet(AbstractDirectoryTestSuite.java:138)
        at org.apache.maven.surefire.suite.AbstractDirectoryTestSuite.execute(AbstractDirectoryTestSuite.java:125)
        at org.apache.maven.surefire.Surefire.run(Surefire.java:132)
        at sun.reflect.NativeMethodAccessorImpl.invoke0(Native Method)
        at sun.reflect.NativeMethodAccessorImpl.invoke(NativeMethodAccessorImpl.java:39)
        at sun.reflect.DelegatingMethodAccessorImpl.invoke(DelegatingMethodAccessorImpl.java:25)
        at java.lang.reflect.Method.invoke(Method.java:597)
        at org.apache.maven.surefire.booter.SurefireBooter.runSuitesInProcess(SurefireBooter.java:290)
        at org.apache.maven.surefire.booter.SurefireBooter.main(SurefireBooter.java:818)
Tests run: 2, Failures: 0, Errors: 0, Skipped: 0, Time elapsed: 0.099 sec
Running org.osaf.cosmo.model.util.ThisAndFutureHelperTest
Tests run: 4, Failures: 0, Errors: 0, Skipped: 0, Time elapsed: 0.457 sec
Running org.osaf.cosmo.eim.schema.contentitem.ContentItemApplicatorTest
Tests run: 2, Failures: 0, Errors: 0, Skipped: 0, Time elapsed: 0.109 sec
Running org.osaf.cosmo.dav.servlet.StandardRequestHandlerTest
Tests run: 10, Failures: 0, Errors: 0, Skipped: 0, Time elapsed: 0.158 sec
Running org.osaf.cosmo.cmp.CmpPutTest
Tests run: 19, Failures: 0, Errors: 0, Skipped: 0, Time elapsed: 0.236 sec
Running org.osaf.cosmo.dav.impl.DavCalendarCollectionTest
Tests run: 1, Failures: 0, Errors: 0, Skipped: 0, Time elapsed: 0.093 sec
Running org.osaf.cosmo.dav.report.ReportBaseTest
Tests run: 1, Failures: 0, Errors: 0, Skipped: 0, Time elapsed: 0.006 sec
Running org.osaf.cosmo.cmp.CmpServerUsageTest
Tests run: 3, Failures: 0, Errors: 0, Skipped: 0, Time elapsed: 0.017 sec
Running org.osaf.cosmo.dav.acl.resource.DavUserPrincipalTest
Tests run: 1, Failures: 0, Errors: 0, Skipped: 0, Time elapsed: 0.039 sec
Running org.osaf.cosmo.dao.hibernate.HibernateContentDaoConcurrencyTest
ERROR - AbstractFlushingEventListener.performExecutions(301) | Could not synchronize database state with session
org.hibernate.StaleObjectStateException: Row was updated or deleted by another transaction (or unsaved-value mapping was incorrect): [org.osaf.cosmo.model.hibernate.HibFileItem#393310]
        at org.hibernate.persister.entity.AbstractEntityPersister.check(AbstractEntityPersister.java:1765)
        at org.hibernate.persister.entity.AbstractEntityPersister.update(AbstractEntityPersister.java:2407)
        at org.hibernate.persister.entity.AbstractEntityPersister.updateOrInsert(AbstractEntityPersister.java:2307)
        at org.hibernate.persister.entity.AbstractEntityPersister.update(AbstractEntityPersister.java:2607)
        at org.hibernate.action.EntityUpdateAction.execute(EntityUpdateAction.java:92)
        at org.hibernate.engine.ActionQueue.execute(ActionQueue.java:250)
        at org.hibernate.engine.ActionQueue.executeActions(ActionQueue.java:234)
        at org.hibernate.engine.ActionQueue.executeActions(ActionQueue.java:142)
        at org.hibernate.event.def.AbstractFlushingEventListener.performExecutions(AbstractFlushingEventListener.java:298)
        at org.hibernate.event.def.DefaultFlushEventListener.onFlush(DefaultFlushEventListener.java:27)
        at org.hibernate.impl.SessionImpl.flush(SessionImpl.java:1000)
        at org.osaf.cosmo.dao.hibernate.ContentDaoImpl.updateContent(ContentDaoImpl.java:318)
        at org.osaf.cosmo.dao.hibernate.HibernateContentDaoConcurrencyTest$5.run(HibernateContentDaoConcurrencyTest.java:158)
        at org.osaf.cosmo.dao.hibernate.HibernateContentDaoConcurrencyTest$TransactionThread.run(HibernateContentDaoConcurrencyTest.java:378)
WARN - LoadContexts.cleanup(108) | fail-safe cleanup (collections) : org.hibernate.engine.loading.CollectionLoadContext@1a66ed5<rs=org.apache.derby.impl.jdbc.EmbedResultSet40@1c34cfe>
Tests run: 2, Failures: 0, Errors: 0, Skipped: 0, Time elapsed: 0.629 sec
Running org.osaf.cosmo.atom.servlet.StandardRequestHandlerTest
Tests run: 10, Failures: 0, Errors: 0, Skipped: 0, Time elapsed: 0.108 sec
Running org.osaf.cosmo.cmp.CmpGetTest
Tests run: 9, Failures: 0, Errors: 4, Skipped: 0, Time elapsed: 0.077 sec <<< FAILURE!
Running org.osaf.cosmo.dav.caldav.report.QueryReportTest
Tests run: 7, Failures: 0, Errors: 0, Skipped: 0, Time elapsed: 0.072 sec
Running org.osaf.cosmo.eim.eimml.EimmlTypeConverterTest
Tests run: 13, Failures: 0, Errors: 0, Skipped: 0, Time elapsed: 0.017 sec
Running org.osaf.cosmo.dao.hibernate.HibernateCalendarDaoTest
Tests run: 5, Failures: 0, Errors: 0, Skipped: 0, Time elapsed: 7.586 sec
Running org.osaf.cosmo.dao.hibernate.HibernateServerPropertyDaoTest
Tests run: 1, Failures: 0, Errors: 0, Skipped: 0, Time elapsed: 0.066 sec
Running org.osaf.cosmo.service.impl.StandardTriageStatusQueryProcessorTest
Tests run: 7, Failures: 0, Errors: 0, Skipped: 0, Time elapsed: 1.292 sec
Running org.osaf.cosmo.calendar.TimeZoneTranslatorTest
Tests run: 2, Failures: 0, Errors: 0, Skipped: 0, Time elapsed: 1.331 sec
Running org.osaf.cosmo.atom.provider.DeleteCollectionTest
Tests run: 1, Failures: 0, Errors: 0, Skipped: 0, Time elapsed: 0.006 sec
Running org.osaf.cosmo.atom.processor.HCalendarProcessorTest
Tests run: 7, Failures: 0, Errors: 0, Skipped: 0, Time elapsed: 3.725 sec
Running org.osaf.cosmo.eim.json.JsonStreamReaderTest
Tests run: 2, Failures: 0, Errors: 0, Skipped: 0, Time elapsed: 0.106 sec
Running org.osaf.cosmo.dav.provider.CreateCollectionTest
[Fatal Error] :1:1: Content is not allowed in prolog.
Tests run: 5, Failures: 0, Errors: 0, Skipped: 0, Time elapsed: 0.087 sec
Running org.osaf.cosmo.eim.schema.modifiedby.ModifiedByApplicatorTest
Tests run: 3, Failures: 0, Errors: 0, Skipped: 0, Time elapsed: 0.01 sec
Running org.osaf.cosmo.model.hibernate.EventStampInterceptorTest
Tests run: 1, Failures: 0, Errors: 0, Skipped: 0, Time elapsed: 0.007 sec
Running org.osaf.cosmo.atom.provider.GetItemTest
ERROR - ItemProvider.getEntry(388) | Unknown entry generation error: Failure mode
org.osaf.cosmo.atom.generator.GeneratorException: Failure mode
        at org.osaf.cosmo.atom.generator.mock.MockItemFeedGenerator.generateEntry(MockItemFeedGenerator.java:81)
        at org.osaf.cosmo.atom.provider.ItemProvider.getEntry(ItemProvider.java:377)
        at org.osaf.cosmo.atom.provider.GetItemTest.testGenerationError(GetItemTest.java:69)
        at sun.reflect.NativeMethodAccessorImpl.invoke0(Native Method)
        at sun.reflect.NativeMethodAccessorImpl.invoke(NativeMethodAccessorImpl.java:39)
        at sun.reflect.DelegatingMethodAccessorImpl.invoke(DelegatingMethodAccessorImpl.java:25)
        at java.lang.reflect.Method.invoke(Method.java:597)
        at junit.framework.TestCase.runTest(TestCase.java:154)
        at junit.framework.TestCase.runBare(TestCase.java:127)
        at junit.framework.TestResult$1.protect(TestResult.java:106)
        at junit.framework.TestResult.runProtected(TestResult.java:124)
        at junit.framework.TestResult.run(TestResult.java:109)
        at junit.framework.TestCase.run(TestCase.java:118)
        at junit.framework.TestSuite.runTest(TestSuite.java:208)
        at junit.framework.TestSuite.run(TestSuite.java:203)
        at sun.reflect.GeneratedMethodAccessor112.invoke(Unknown Source)
        at sun.reflect.DelegatingMethodAccessorImpl.invoke(DelegatingMethodAccessorImpl.java:25)
        at java.lang.reflect.Method.invoke(Method.java:597)
        at org.apache.maven.surefire.junit.JUnitTestSet.execute(JUnitTestSet.java:213)
        at org.apache.maven.surefire.suite.AbstractDirectoryTestSuite.executeTestSet(AbstractDirectoryTestSuite.java:138)
        at org.apache.maven.surefire.suite.AbstractDirectoryTestSuite.execute(AbstractDirectoryTestSuite.java:125)
        at org.apache.maven.surefire.Surefire.run(Surefire.java:132)
        at sun.reflect.NativeMethodAccessorImpl.invoke0(Native Method)
        at sun.reflect.NativeMethodAccessorImpl.invoke(NativeMethodAccessorImpl.java:39)
        at sun.reflect.DelegatingMethodAccessorImpl.invoke(DelegatingMethodAccessorImpl.java:25)
        at java.lang.reflect.Method.invoke(Method.java:597)
        at org.apache.maven.surefire.booter.SurefireBooter.runSuitesInProcess(SurefireBooter.java:290)
        at org.apache.maven.surefire.booter.SurefireBooter.main(SurefireBooter.java:818)
Tests run: 4, Failures: 0, Errors: 0, Skipped: 0, Time elapsed: 0.08 sec
Running org.osaf.cosmo.calendar.ICalDateTest
Tests run: 8, Failures: 0, Errors: 0, Skipped: 0, Time elapsed: 0.173 sec
Running org.osaf.cosmo.eim.schema.event.alarm.DisplayAlarmApplicatorTest
Tests run: 4, Failures: 0, Errors: 0, Skipped: 0, Time elapsed: 0.971 sec
Running org.osaf.cosmo.calendar.query.CalendarFilterEvaluaterTest
Tests run: 14, Failures: 0, Errors: 0, Skipped: 0, Time elapsed: 0.246 sec
Running org.osaf.cosmo.eim.schema.contentitem.ContentItemGeneratorTest
Tests run: 3, Failures: 0, Errors: 0, Skipped: 0, Time elapsed: 0.01 sec
Running org.osaf.cosmo.eim.schema.EimValueConverterTest
Tests run: 3, Failures: 0, Errors: 0, Skipped: 0, Time elapsed: 0.006 sec
Running org.osaf.cosmo.atom.provider.AddItemToCollectionTest
Tests run: 4, Failures: 0, Errors: 0, Skipped: 0, Time elapsed: 0.053 sec
Running org.osaf.cosmo.dao.hibernate.HibernateContentDaoTombstonesTest
Tests run: 3, Failures: 0, Errors: 0, Skipped: 0, Time elapsed: 0.192 sec
Running org.osaf.cosmo.eim.schema.BaseItemApplicatorTest
Tests run: 4, Failures: 0, Errors: 0, Skipped: 0, Time elapsed: 0.076 sec
Running org.osaf.cosmo.atom.provider.DeleteItemTest
Tests run: 4, Failures: 0, Errors: 0, Skipped: 0, Time elapsed: 0.023 sec
Running org.osaf.cosmo.calendar.CalendarQueryFilterTest
Tests run: 10, Failures: 0, Errors: 0, Skipped: 0, Time elapsed: 0.069 sec
Running org.osaf.cosmo.eim.schema.text.DurationFormatTest
Tests run: 2, Failures: 0, Errors: 0, Skipped: 0, Time elapsed: 0.003 sec
Running org.osaf.cosmo.atom.provider.CreateSubscriptionTest
ERROR - SubscriptionProvider.createEntry(92) | Unknown entry generation error: Failure mode
org.osaf.cosmo.atom.generator.GeneratorException: Failure mode
        at org.osaf.cosmo.atom.generator.mock.MockSubscriptionFeedGenerator.generateEntry(MockSubscriptionFeedGenerator.java:70)
        at org.osaf.cosmo.atom.provider.SubscriptionProvider.createEntry(SubscriptionProvider.java:78)
        at org.osaf.cosmo.atom.provider.CreateSubscriptionTest.testGenerationError(CreateSubscriptionTest.java:68)
        at sun.reflect.NativeMethodAccessorImpl.invoke0(Native Method)
        at sun.reflect.NativeMethodAccessorImpl.invoke(NativeMethodAccessorImpl.java:39)
        at sun.reflect.DelegatingMethodAccessorImpl.invoke(DelegatingMethodAccessorImpl.java:25)
        at java.lang.reflect.Method.invoke(Method.java:597)
        at junit.framework.TestCase.runTest(TestCase.java:154)
        at junit.framework.TestCase.runBare(TestCase.java:127)
        at junit.framework.TestResult$1.protect(TestResult.java:106)
        at junit.framework.TestResult.runProtected(TestResult.java:124)
        at junit.framework.TestResult.run(TestResult.java:109)
        at junit.framework.TestCase.run(TestCase.java:118)
        at junit.framework.TestSuite.runTest(TestSuite.java:208)
        at junit.framework.TestSuite.run(TestSuite.java:203)
        at sun.reflect.GeneratedMethodAccessor112.invoke(Unknown Source)
        at sun.reflect.DelegatingMethodAccessorImpl.invoke(DelegatingMethodAccessorImpl.java:25)
        at java.lang.reflect.Method.invoke(Method.java:597)
        at org.apache.maven.surefire.junit.JUnitTestSet.execute(JUnitTestSet.java:213)
        at org.apache.maven.surefire.suite.AbstractDirectoryTestSuite.executeTestSet(AbstractDirectoryTestSuite.java:138)
        at org.apache.maven.surefire.suite.AbstractDirectoryTestSuite.execute(AbstractDirectoryTestSuite.java:125)
        at org.apache.maven.surefire.Surefire.run(Surefire.java:132)
        at sun.reflect.NativeMethodAccessorImpl.invoke0(Native Method)
        at sun.reflect.NativeMethodAccessorImpl.invoke(NativeMethodAccessorImpl.java:39)
        at sun.reflect.DelegatingMethodAccessorImpl.invoke(DelegatingMethodAccessorImpl.java:25)
        at java.lang.reflect.Method.invoke(Method.java:597)
        at org.apache.maven.surefire.booter.SurefireBooter.runSuitesInProcess(SurefireBooter.java:290)
        at org.apache.maven.surefire.booter.SurefireBooter.main(SurefireBooter.java:818)
Tests run: 5, Failures: 0, Errors: 0, Skipped: 0, Time elapsed: 0.141 sec
Running org.osaf.cosmo.calendar.InstanceListTest
Tests run: 20, Failures: 0, Errors: 0, Skipped: 0, Time elapsed: 0.866 sec
Running org.osaf.cosmo.TestHelper
Tests run: 0, Failures: 0, Errors: 0, Skipped: 0, Time elapsed: 0.001 sec
Running org.osaf.cosmo.eim.schema.event.EventGeneratorTest
Tests run: 2, Failures: 0, Errors: 0, Skipped: 0, Time elapsed: 0.067 sec
Running org.osaf.cosmo.atom.provider.GetPreferenceTest
ERROR - PreferencesProvider.getEntry(207) | Unknown entry generation error: Failure mode
org.osaf.cosmo.atom.generator.GeneratorException: Failure mode
        at org.osaf.cosmo.atom.generator.mock.MockPreferencesFeedGenerator.generateEntry(MockPreferencesFeedGenerator.java:68)
        at org.osaf.cosmo.atom.provider.PreferencesProvider.getEntry(PreferencesProvider.java:202)
        at org.osaf.cosmo.atom.provider.GetPreferenceTest.testGenerationError(GetPreferenceTest.java:49)
        at sun.reflect.NativeMethodAccessorImpl.invoke0(Native Method)
        at sun.reflect.NativeMethodAccessorImpl.invoke(NativeMethodAccessorImpl.java:39)
        at sun.reflect.DelegatingMethodAccessorImpl.invoke(DelegatingMethodAccessorImpl.java:25)
        at java.lang.reflect.Method.invoke(Method.java:597)
        at junit.framework.TestCase.runTest(TestCase.java:154)
        at junit.framework.TestCase.runBare(TestCase.java:127)
        at junit.framework.TestResult$1.protect(TestResult.java:106)
        at junit.framework.TestResult.runProtected(TestResult.java:124)
        at junit.framework.TestResult.run(TestResult.java:109)
        at junit.framework.TestCase.run(TestCase.java:118)
        at junit.framework.TestSuite.runTest(TestSuite.java:208)
        at junit.framework.TestSuite.run(TestSuite.java:203)
        at sun.reflect.GeneratedMethodAccessor112.invoke(Unknown Source)
        at sun.reflect.DelegatingMethodAccessorImpl.invoke(DelegatingMethodAccessorImpl.java:25)
        at java.lang.reflect.Method.invoke(Method.java:597)
        at org.apache.maven.surefire.junit.JUnitTestSet.execute(JUnitTestSet.java:213)
        at org.apache.maven.surefire.suite.AbstractDirectoryTestSuite.executeTestSet(AbstractDirectoryTestSuite.java:138)
        at org.apache.maven.surefire.suite.AbstractDirectoryTestSuite.execute(AbstractDirectoryTestSuite.java:125)
        at org.apache.maven.surefire.Surefire.run(Surefire.java:132)
        at sun.reflect.NativeMethodAccessorImpl.invoke0(Native Method)
        at sun.reflect.NativeMethodAccessorImpl.invoke(NativeMethodAccessorImpl.java:39)
        at sun.reflect.DelegatingMethodAccessorImpl.invoke(DelegatingMethodAccessorImpl.java:25)
        at java.lang.reflect.Method.invoke(Method.java:597)
        at org.apache.maven.surefire.booter.SurefireBooter.runSuitesInProcess(SurefireBooter.java:290)
        at org.apache.maven.surefire.booter.SurefireBooter.main(SurefireBooter.java:818)
Tests run: 2, Failures: 0, Errors: 0, Skipped: 0, Time elapsed: 0.074 sec
Running org.osaf.cosmo.atom.provider.UpdateCollectionTest
Tests run: 3, Failures: 0, Errors: 0, Skipped: 0, Time elapsed: 0.029 sec
Running org.osaf.cosmo.dao.hibernate.query.StandardItemFilterProcessorTest
Tests run: 10, Failures: 0, Errors: 0, Skipped: 0, Time elapsed: 0.137 sec
Running org.osaf.cosmo.dao.hibernate.HibernateContentDaoModificationsTest
Tests run: 2, Failures: 0, Errors: 0, Skipped: 0, Time elapsed: 0.12 sec
Running org.osaf.cosmo.model.EventStampTest
Tests run: 5, Failures: 0, Errors: 0, Skipped: 0, Time elapsed: 0.156 sec
Running org.osaf.cosmo.calendar.ICalValueParserTest
Tests run: 4, Failures: 0, Errors: 0, Skipped: 0, Time elapsed: 0.005 sec
Running org.osaf.cosmo.dav.impl.DavCalendarResourceTest
Tests run: 1, Failures: 0, Errors: 0, Skipped: 0, Time elapsed: 0.001 sec
Running org.osaf.cosmo.eim.schema.BaseStampApplicatorTest
Tests run: 4, Failures: 0, Errors: 0, Skipped: 0, Time elapsed: 0.003 sec
Running org.osaf.cosmo.eim.schema.event.EventApplicatorTest
Tests run: 5, Failures: 0, Errors: 0, Skipped: 0, Time elapsed: 0.062 sec
Running org.osaf.cosmo.atom.provider.UpdateSubscriptionTest
ERROR - SubscriptionProvider.updateEntry(160) | Unknown entry generation error: Failure mode
org.osaf.cosmo.atom.generator.GeneratorException: Failure mode
        at org.osaf.cosmo.atom.generator.mock.MockSubscriptionFeedGenerator.generateEntry(MockSubscriptionFeedGenerator.java:70)
        at org.osaf.cosmo.atom.provider.SubscriptionProvider.updateEntry(SubscriptionProvider.java:145)
        at org.osaf.cosmo.atom.provider.UpdateSubscriptionTest.testGenerationError(UpdateSubscriptionTest.java:69)
        at sun.reflect.NativeMethodAccessorImpl.invoke0(Native Method)
        at sun.reflect.NativeMethodAccessorImpl.invoke(NativeMethodAccessorImpl.java:39)
        at sun.reflect.DelegatingMethodAccessorImpl.invoke(DelegatingMethodAccessorImpl.java:25)
        at java.lang.reflect.Method.invoke(Method.java:597)
        at junit.framework.TestCase.runTest(TestCase.java:154)
        at junit.framework.TestCase.runBare(TestCase.java:127)
        at junit.framework.TestResult$1.protect(TestResult.java:106)
        at junit.framework.TestResult.runProtected(TestResult.java:124)
        at junit.framework.TestResult.run(TestResult.java:109)
        at junit.framework.TestCase.run(TestCase.java:118)
        at junit.framework.TestSuite.runTest(TestSuite.java:208)
        at junit.framework.TestSuite.run(TestSuite.java:203)
        at sun.reflect.GeneratedMethodAccessor112.invoke(Unknown Source)
        at sun.reflect.DelegatingMethodAccessorImpl.invoke(DelegatingMethodAccessorImpl.java:25)
        at java.lang.reflect.Method.invoke(Method.java:597)
        at org.apache.maven.surefire.junit.JUnitTestSet.execute(JUnitTestSet.java:213)
        at org.apache.maven.surefire.suite.AbstractDirectoryTestSuite.executeTestSet(AbstractDirectoryTestSuite.java:138)
        at org.apache.maven.surefire.suite.AbstractDirectoryTestSuite.execute(AbstractDirectoryTestSuite.java:125)
        at org.apache.maven.surefire.Surefire.run(Surefire.java:132)
        at sun.reflect.NativeMethodAccessorImpl.invoke0(Native Method)
        at sun.reflect.NativeMethodAccessorImpl.invoke(NativeMethodAccessorImpl.java:39)
        at sun.reflect.DelegatingMethodAccessorImpl.invoke(DelegatingMethodAccessorImpl.java:25)
        at java.lang.reflect.Method.invoke(Method.java:597)
        at org.apache.maven.surefire.booter.SurefireBooter.runSuitesInProcess(SurefireBooter.java:290)
        at org.apache.maven.surefire.booter.SurefireBooter.main(SurefireBooter.java:818)
Tests run: 5, Failures: 0, Errors: 0, Skipped: 0, Time elapsed: 0.059 sec
Running org.osaf.cosmo.model.ModificationUidTest
Tests run: 1, Failures: 0, Errors: 0, Skipped: 0, Time elapsed: 0.007 sec
Running org.osaf.cosmo.atom.provider.CreatePreferenceTest
ERROR - PreferencesProvider.createEntry(90) | Unknown entry generation error: Failure mode
org.osaf.cosmo.atom.generator.GeneratorException: Failure mode
        at org.osaf.cosmo.atom.generator.mock.MockPreferencesFeedGenerator.generateEntry(MockPreferencesFeedGenerator.java:68)
        at org.osaf.cosmo.atom.provider.PreferencesProvider.createEntry(PreferencesProvider.java:76)
        at org.osaf.cosmo.atom.provider.CreatePreferenceTest.testGenerationError(CreatePreferenceTest.java:62)
        at sun.reflect.NativeMethodAccessorImpl.invoke0(Native Method)
        at sun.reflect.NativeMethodAccessorImpl.invoke(NativeMethodAccessorImpl.java:39)
        at sun.reflect.DelegatingMethodAccessorImpl.invoke(DelegatingMethodAccessorImpl.java:25)
        at java.lang.reflect.Method.invoke(Method.java:597)
        at junit.framework.TestCase.runTest(TestCase.java:154)
        at junit.framework.TestCase.runBare(TestCase.java:127)
        at junit.framework.TestResult$1.protect(TestResult.java:106)
        at junit.framework.TestResult.runProtected(TestResult.java:124)
        at junit.framework.TestResult.run(TestResult.java:109)
        at junit.framework.TestCase.run(TestCase.java:118)
        at junit.framework.TestSuite.runTest(TestSuite.java:208)
        at junit.framework.TestSuite.run(TestSuite.java:203)
        at sun.reflect.GeneratedMethodAccessor112.invoke(Unknown Source)
        at sun.reflect.DelegatingMethodAccessorImpl.invoke(DelegatingMethodAccessorImpl.java:25)
        at java.lang.reflect.Method.invoke(Method.java:597)
        at org.apache.maven.surefire.junit.JUnitTestSet.execute(JUnitTestSet.java:213)
        at org.apache.maven.surefire.suite.AbstractDirectoryTestSuite.executeTestSet(AbstractDirectoryTestSuite.java:138)
        at org.apache.maven.surefire.suite.AbstractDirectoryTestSuite.execute(AbstractDirectoryTestSuite.java:125)
        at org.apache.maven.surefire.Surefire.run(Surefire.java:132)
        at sun.reflect.NativeMethodAccessorImpl.invoke0(Native Method)
        at sun.reflect.NativeMethodAccessorImpl.invoke(NativeMethodAccessorImpl.java:39)
        at sun.reflect.DelegatingMethodAccessorImpl.invoke(DelegatingMethodAccessorImpl.java:25)
        at java.lang.reflect.Method.invoke(Method.java:597)
        at org.apache.maven.surefire.booter.SurefireBooter.runSuitesInProcess(SurefireBooter.java:290)
        at org.apache.maven.surefire.booter.SurefireBooter.main(SurefireBooter.java:818)
Tests run: 5, Failures: 0, Errors: 0, Skipped: 0, Time elapsed: 0.095 sec
Running org.osaf.cosmo.dao.hibernate.HibernateUserDaoSubscriptionTest
Tests run: 1, Failures: 0, Errors: 0, Skipped: 0, Time elapsed: 0.052 sec
Running org.osaf.cosmo.calendar.query.impl.StandardCalendarQueryProcessorTest
Tests run: 2, Failures: 0, Errors: 0, Skipped: 0, Time elapsed: 0.985 sec
Running org.osaf.cosmo.dav.impl.DavCollectionBaseTest
Tests run: 7, Failures: 0, Errors: 0, Skipped: 0, Time elapsed: 0.005 sec
Running org.osaf.cosmo.dav.caldav.report.MultigetReportTest
Tests run: 9, Failures: 0, Errors: 0, Skipped: 0, Time elapsed: 0.091 sec
Running org.osaf.cosmo.eim.eimml.EimmlStreamWriterTest
Tests run: 1, Failures: 0, Errors: 0, Skipped: 0, Time elapsed: 0.028 sec
Running org.osaf.cosmo.calendar.data.LimitRecurrenceSetTest
Tests run: 3, Failures: 0, Errors: 0, Skipped: 0, Time elapsed: 0.291 sec
Running org.osaf.cosmo.atom.provider.DeletePreferenceTest
Tests run: 1, Failures: 0, Errors: 0, Skipped: 0, Time elapsed: 0.006 sec
Running org.osaf.cosmo.service.impl.StandardUserServiceTest
Tests run: 14, Failures: 0, Errors: 0, Skipped: 0, Time elapsed: 2.01 sec
Running org.osaf.cosmo.eim.schema.message.MessageApplicatorTest
Tests run: 2, Failures: 0, Errors: 0, Skipped: 0, Time elapsed: 0.012 sec
Running org.osaf.cosmo.dao.hibernate.HibernateItemDaoFilterTest
Tests run: 6, Failures: 0, Errors: 0, Skipped: 0, Time elapsed: 7.619 sec
Running org.osaf.cosmo.atom.provider.GetSubscriptionsTest
ERROR - SubscriptionProvider.getFeed(189) | Unknown feed generation error: Failure mode
org.osaf.cosmo.atom.generator.GeneratorException: Failure mode
        at org.osaf.cosmo.atom.generator.mock.MockSubscriptionFeedGenerator.generateFeed(MockSubscriptionFeedGenerator.java:63)
        at org.osaf.cosmo.atom.provider.SubscriptionProvider.getFeed(SubscriptionProvider.java:184)
        at org.osaf.cosmo.atom.provider.GetSubscriptionsTest.testGenerationError(GetSubscriptionsTest.java:49)
        at sun.reflect.NativeMethodAccessorImpl.invoke0(Native Method)
        at sun.reflect.NativeMethodAccessorImpl.invoke(NativeMethodAccessorImpl.java:39)
        at sun.reflect.DelegatingMethodAccessorImpl.invoke(DelegatingMethodAccessorImpl.java:25)
        at java.lang.reflect.Method.invoke(Method.java:597)
        at junit.framework.TestCase.runTest(TestCase.java:154)
        at junit.framework.TestCase.runBare(TestCase.java:127)
        at junit.framework.TestResult$1.protect(TestResult.java:106)
        at junit.framework.TestResult.runProtected(TestResult.java:124)
        at junit.framework.TestResult.run(TestResult.java:109)
        at junit.framework.TestCase.run(TestCase.java:118)
        at junit.framework.TestSuite.runTest(TestSuite.java:208)
        at junit.framework.TestSuite.run(TestSuite.java:203)
        at sun.reflect.GeneratedMethodAccessor112.invoke(Unknown Source)
        at sun.reflect.DelegatingMethodAccessorImpl.invoke(DelegatingMethodAccessorImpl.java:25)
        at java.lang.reflect.Method.invoke(Method.java:597)
        at org.apache.maven.surefire.junit.JUnitTestSet.execute(JUnitTestSet.java:213)
        at org.apache.maven.surefire.suite.AbstractDirectoryTestSuite.executeTestSet(AbstractDirectoryTestSuite.java:138)
        at org.apache.maven.surefire.suite.AbstractDirectoryTestSuite.execute(AbstractDirectoryTestSuite.java:125)
        at org.apache.maven.surefire.Surefire.run(Surefire.java:132)
        at sun.reflect.NativeMethodAccessorImpl.invoke0(Native Method)
        at sun.reflect.NativeMethodAccessorImpl.invoke(NativeMethodAccessorImpl.java:39)
        at sun.reflect.DelegatingMethodAccessorImpl.invoke(DelegatingMethodAccessorImpl.java:25)
        at java.lang.reflect.Method.invoke(Method.java:597)
        at org.apache.maven.surefire.booter.SurefireBooter.runSuitesInProcess(SurefireBooter.java:290)
        at org.apache.maven.surefire.booter.SurefireBooter.main(SurefireBooter.java:818)
Tests run: 2, Failures: 0, Errors: 0, Skipped: 0, Time elapsed: 0.013 sec
Running org.osaf.cosmo.eim.schema.event.alarm.DisplayAlarmGeneratorTest
Tests run: 5, Failures: 0, Errors: 0, Skipped: 0, Time elapsed: 0.054 sec
Running org.osaf.cosmo.atom.provider.UpdateItemTest
ERROR - ItemProvider.updateEntry(283) | Unknown content processing error: Failure mode
org.osaf.cosmo.atom.processor.ProcessorException: Failure mode
        at org.osaf.cosmo.atom.processor.mock.MockContentProcessor.processContent(MockContentProcessor.java:94)
        at org.osaf.cosmo.atom.processor.BaseContentProcessor.processContent(BaseContentProcessor.java:64)
        at org.osaf.cosmo.atom.provider.ItemProvider.processEntryUpdate(ItemProvider.java:693)
        at org.osaf.cosmo.atom.provider.ItemProvider.updateEntry(ItemProvider.java:249)
        at org.osaf.cosmo.atom.provider.UpdateItemTest.testProcessingError(UpdateItemTest.java:94)
        at sun.reflect.NativeMethodAccessorImpl.invoke0(Native Method)
        at sun.reflect.NativeMethodAccessorImpl.invoke(NativeMethodAccessorImpl.java:39)
        at sun.reflect.DelegatingMethodAccessorImpl.invoke(DelegatingMethodAccessorImpl.java:25)
        at java.lang.reflect.Method.invoke(Method.java:597)
        at junit.framework.TestCase.runTest(TestCase.java:154)
        at junit.framework.TestCase.runBare(TestCase.java:127)
        at junit.framework.TestResult$1.protect(TestResult.java:106)
        at junit.framework.TestResult.runProtected(TestResult.java:124)
        at junit.framework.TestResult.run(TestResult.java:109)
        at junit.framework.TestCase.run(TestCase.java:118)
        at junit.framework.TestSuite.runTest(TestSuite.java:208)
        at junit.framework.TestSuite.run(TestSuite.java:203)
        at sun.reflect.GeneratedMethodAccessor112.invoke(Unknown Source)
        at sun.reflect.DelegatingMethodAccessorImpl.invoke(DelegatingMethodAccessorImpl.java:25)
        at java.lang.reflect.Method.invoke(Method.java:597)
        at org.apache.maven.surefire.junit.JUnitTestSet.execute(JUnitTestSet.java:213)
        at org.apache.maven.surefire.suite.AbstractDirectoryTestSuite.executeTestSet(AbstractDirectoryTestSuite.java:138)
        at org.apache.maven.surefire.suite.AbstractDirectoryTestSuite.execute(AbstractDirectoryTestSuite.java:125)
        at org.apache.maven.surefire.Surefire.run(Surefire.java:132)
        at sun.reflect.NativeMethodAccessorImpl.invoke0(Native Method)
        at sun.reflect.NativeMethodAccessorImpl.invoke(NativeMethodAccessorImpl.java:39)
        at sun.reflect.DelegatingMethodAccessorImpl.invoke(DelegatingMethodAccessorImpl.java:25)
        at java.lang.reflect.Method.invoke(Method.java:597)
        at org.apache.maven.surefire.booter.SurefireBooter.runSuitesInProcess(SurefireBooter.java:290)
        at org.apache.maven.surefire.booter.SurefireBooter.main(SurefireBooter.java:818)
Tests run: 5, Failures: 0, Errors: 0, Skipped: 0, Time elapsed: 0.111 sec
Running org.osaf.cosmo.server.CollectionPathTest
Tests run: 7, Failures: 0, Errors: 0, Skipped: 0, Time elapsed: 0.039 sec
Running org.osaf.cosmo.dav.caldav.report.FreeBusyReportTest
Tests run: 4, Failures: 0, Errors: 0, Skipped: 0, Time elapsed: 0.026 sec
Running org.osaf.cosmo.eim.json.JsonStreamWriterTest
ERROR - JsonStreamWriterTest.testUnicodeClob(113) | unicode: åß∂ƒ©˙∆˚¬…


ERROR - JsonStreamWriterTest.testUnicodeClob(126) | UTF-8 JSON: {"unicode":["clob","åß∂ƒ©˙∆˚¬…\u2028\u2029"]}
Tests run: 3, Failures: 0, Errors: 0, Skipped: 0, Time elapsed: 0.094 sec
Running org.osaf.cosmo.service.impl.HibernateTriageStatusQueryProcessorTest
Tests run: 7, Failures: 0, Errors: 0, Skipped: 0, Time elapsed: 5.095 sec
Running org.osaf.cosmo.dao.hibernate.HibernateContentDaoStampingTest
Tests run: 9, Failures: 0, Errors: 0, Skipped: 0, Time elapsed: 0.31 sec
Running org.osaf.cosmo.dao.hibernate.HibernateUserDaoTest
Tests run: 9, Failures: 0, Errors: 0, Skipped: 0, Time elapsed: 0.229 sec
Running org.osaf.cosmo.service.impl.StandardContentServiceTest
Tests run: 11, Failures: 0, Errors: 0, Skipped: 0, Time elapsed: 0.477 sec
Running org.osaf.cosmo.atom.provider.UpdatePreferenceTest
ERROR - PreferencesProvider.updateEntry(156) | Unknown entry generation error: Failure mode
org.osaf.cosmo.atom.generator.GeneratorException: Failure mode
        at org.osaf.cosmo.atom.generator.mock.MockPreferencesFeedGenerator.generateEntry(MockPreferencesFeedGenerator.java:68)
        at org.osaf.cosmo.atom.provider.PreferencesProvider.updateEntry(PreferencesProvider.java:141)
        at org.osaf.cosmo.atom.provider.UpdatePreferenceTest.testGenerationError(UpdatePreferenceTest.java:65)
        at sun.reflect.NativeMethodAccessorImpl.invoke0(Native Method)
        at sun.reflect.NativeMethodAccessorImpl.invoke(NativeMethodAccessorImpl.java:39)
        at sun.reflect.DelegatingMethodAccessorImpl.invoke(DelegatingMethodAccessorImpl.java:25)
        at java.lang.reflect.Method.invoke(Method.java:597)
        at junit.framework.TestCase.runTest(TestCase.java:154)
        at junit.framework.TestCase.runBare(TestCase.java:127)
        at junit.framework.TestResult$1.protect(TestResult.java:106)
        at junit.framework.TestResult.runProtected(TestResult.java:124)
        at junit.framework.TestResult.run(TestResult.java:109)
        at junit.framework.TestCase.run(TestCase.java:118)
        at junit.framework.TestSuite.runTest(TestSuite.java:208)
        at junit.framework.TestSuite.run(TestSuite.java:203)
        at sun.reflect.GeneratedMethodAccessor112.invoke(Unknown Source)
        at sun.reflect.DelegatingMethodAccessorImpl.invoke(DelegatingMethodAccessorImpl.java:25)
        at java.lang.reflect.Method.invoke(Method.java:597)
        at org.apache.maven.surefire.junit.JUnitTestSet.execute(JUnitTestSet.java:213)
        at org.apache.maven.surefire.suite.AbstractDirectoryTestSuite.executeTestSet(AbstractDirectoryTestSuite.java:138)
        at org.apache.maven.surefire.suite.AbstractDirectoryTestSuite.execute(AbstractDirectoryTestSuite.java:125)
        at org.apache.maven.surefire.Surefire.run(Surefire.java:132)
        at sun.reflect.NativeMethodAccessorImpl.invoke0(Native Method)
        at sun.reflect.NativeMethodAccessorImpl.invoke(NativeMethodAccessorImpl.java:39)
        at sun.reflect.DelegatingMethodAccessorImpl.invoke(DelegatingMethodAccessorImpl.java:25)
        at java.lang.reflect.Method.invoke(Method.java:597)
        at org.apache.maven.surefire.booter.SurefireBooter.runSuitesInProcess(SurefireBooter.java:290)
        at org.apache.maven.surefire.booter.SurefireBooter.main(SurefireBooter.java:818)
Tests run: 5, Failures: 0, Errors: 0, Skipped: 0, Time elapsed: 0.071 sec
Running org.osaf.cosmo.eim.eimml.EimmlStreamReaderTest
Tests run: 1, Failures: 0, Errors: 0, Skipped: 0, Time elapsed: 0.064 sec
Running org.osaf.cosmo.eim.schema.modifiedby.ModifiedByGeneratorTest
Tests run: 1, Failures: 0, Errors: 0, Skipped: 0, Time elapsed: 0.016 sec
Running org.osaf.cosmo.atom.provider.GetCollectionTest
ERROR - ItemProvider.getFeed(362) | Unknown feed generation error: Failure mode
org.osaf.cosmo.atom.generator.GeneratorException: Failure mode
        at org.osaf.cosmo.atom.generator.mock.MockItemFeedGenerator.generateFeed(MockItemFeedGenerator.java:67)
        at org.osaf.cosmo.atom.provider.ItemProvider.getFeed(ItemProvider.java:349)
        at org.osaf.cosmo.atom.provider.GetCollectionTest.testGenerationError(GetCollectionTest.java:69)
        at sun.reflect.NativeMethodAccessorImpl.invoke0(Native Method)
        at sun.reflect.NativeMethodAccessorImpl.invoke(NativeMethodAccessorImpl.java:39)
        at sun.reflect.DelegatingMethodAccessorImpl.invoke(DelegatingMethodAccessorImpl.java:25)
        at java.lang.reflect.Method.invoke(Method.java:597)
        at junit.framework.TestCase.runTest(TestCase.java:154)
        at junit.framework.TestCase.runBare(TestCase.java:127)
        at junit.framework.TestResult$1.protect(TestResult.java:106)
        at junit.framework.TestResult.runProtected(TestResult.java:124)
        at junit.framework.TestResult.run(TestResult.java:109)
        at junit.framework.TestCase.run(TestCase.java:118)
        at junit.framework.TestSuite.runTest(TestSuite.java:208)
        at junit.framework.TestSuite.run(TestSuite.java:203)
        at sun.reflect.GeneratedMethodAccessor112.invoke(Unknown Source)
        at sun.reflect.DelegatingMethodAccessorImpl.invoke(DelegatingMethodAccessorImpl.java:25)
        at java.lang.reflect.Method.invoke(Method.java:597)
        at org.apache.maven.surefire.junit.JUnitTestSet.execute(JUnitTestSet.java:213)
        at org.apache.maven.surefire.suite.AbstractDirectoryTestSuite.executeTestSet(AbstractDirectoryTestSuite.java:138)
        at org.apache.maven.surefire.suite.AbstractDirectoryTestSuite.execute(AbstractDirectoryTestSuite.java:125)
        at org.apache.maven.surefire.Surefire.run(Surefire.java:132)
        at sun.reflect.NativeMethodAccessorImpl.invoke0(Native Method)
        at sun.reflect.NativeMethodAccessorImpl.invoke(NativeMethodAccessorImpl.java:39)
        at sun.reflect.DelegatingMethodAccessorImpl.invoke(DelegatingMethodAccessorImpl.java:25)
        at java.lang.reflect.Method.invoke(Method.java:597)
        at org.apache.maven.surefire.booter.SurefireBooter.runSuitesInProcess(SurefireBooter.java:290)
        at org.apache.maven.surefire.booter.SurefireBooter.main(SurefireBooter.java:818)
Tests run: 4, Failures: 0, Errors: 0, Skipped: 0, Time elapsed: 0.053 sec
Running org.osaf.cosmo.calendar.RecurrenceExpanderTest
Tests run: 7, Failures: 0, Errors: 0, Skipped: 0, Time elapsed: 0.788 sec
Running org.osaf.cosmo.eim.schema.occurrenceitem.OccurrenceItemGeneratorTest
Tests run: 1, Failures: 0, Errors: 0, Skipped: 0, Time elapsed: 0.003 sec
Running org.osaf.cosmo.model.NoteOccurrenceTest
Tests run: 1, Failures: 0, Errors: 0, Skipped: 0, Time elapsed: 0.002 sec
Running org.osaf.cosmo.atom.provider.GetExpandedItemTest
ERROR - ExpandedItemProvider.getFeed(92) | Unknown feed generation error: Failure mode
org.osaf.cosmo.atom.generator.GeneratorException: Failure mode
        at org.osaf.cosmo.atom.generator.mock.MockItemFeedGenerator.generateFeed(MockItemFeedGenerator.java:74)
        at org.osaf.cosmo.atom.provider.ExpandedItemProvider.getFeed(ExpandedItemProvider.java:79)
        at org.osaf.cosmo.atom.provider.GetExpandedItemTest.testGenerationError(GetExpandedItemTest.java:70)
        at sun.reflect.NativeMethodAccessorImpl.invoke0(Native Method)
        at sun.reflect.NativeMethodAccessorImpl.invoke(NativeMethodAccessorImpl.java:39)
        at sun.reflect.DelegatingMethodAccessorImpl.invoke(DelegatingMethodAccessorImpl.java:25)
        at java.lang.reflect.Method.invoke(Method.java:597)
        at junit.framework.TestCase.runTest(TestCase.java:154)
        at junit.framework.TestCase.runBare(TestCase.java:127)
        at junit.framework.TestResult$1.protect(TestResult.java:106)
        at junit.framework.TestResult.runProtected(TestResult.java:124)
        at junit.framework.TestResult.run(TestResult.java:109)
        at junit.framework.TestCase.run(TestCase.java:118)
        at junit.framework.TestSuite.runTest(TestSuite.java:208)
        at junit.framework.TestSuite.run(TestSuite.java:203)
        at sun.reflect.GeneratedMethodAccessor112.invoke(Unknown Source)
        at sun.reflect.DelegatingMethodAccessorImpl.invoke(DelegatingMethodAccessorImpl.java:25)
        at java.lang.reflect.Method.invoke(Method.java:597)
        at org.apache.maven.surefire.junit.JUnitTestSet.execute(JUnitTestSet.java:213)
        at org.apache.maven.surefire.suite.AbstractDirectoryTestSuite.executeTestSet(AbstractDirectoryTestSuite.java:138)
        at org.apache.maven.surefire.suite.AbstractDirectoryTestSuite.execute(AbstractDirectoryTestSuite.java:125)
        at org.apache.maven.surefire.Surefire.run(Surefire.java:132)
        at sun.reflect.NativeMethodAccessorImpl.invoke0(Native Method)
        at sun.reflect.NativeMethodAccessorImpl.invoke(NativeMethodAccessorImpl.java:39)
        at sun.reflect.DelegatingMethodAccessorImpl.invoke(DelegatingMethodAccessorImpl.java:25)
        at java.lang.reflect.Method.invoke(Method.java:597)
        at org.apache.maven.surefire.booter.SurefireBooter.runSuitesInProcess(SurefireBooter.java:290)
        at org.apache.maven.surefire.booter.SurefireBooter.main(SurefireBooter.java:818)
Tests run: 4, Failures: 0, Errors: 0, Skipped: 0, Time elapsed: 0.071 sec
Running org.osaf.cosmo.atom.provider.CreateItemTest
ERROR - ItemProvider.createEntry(193) | Unknown content processing error: Failure mode
org.osaf.cosmo.atom.processor.ProcessorException: Failure mode
        at org.osaf.cosmo.atom.processor.mock.MockContentProcessor.processCreation(MockContentProcessor.java:68)
        at org.osaf.cosmo.atom.processor.BaseContentProcessor.processCreation(BaseContentProcessor.java:49)
        at org.osaf.cosmo.atom.provider.ItemProvider.createEntry(ItemProvider.java:141)
        at org.osaf.cosmo.atom.provider.CreateItemTest.testProcessingError(CreateItemTest.java:110)
        at sun.reflect.NativeMethodAccessorImpl.invoke0(Native Method)
        at sun.reflect.NativeMethodAccessorImpl.invoke(NativeMethodAccessorImpl.java:39)
        at sun.reflect.DelegatingMethodAccessorImpl.invoke(DelegatingMethodAccessorImpl.java:25)
        at java.lang.reflect.Method.invoke(Method.java:597)
        at junit.framework.TestCase.runTest(TestCase.java:154)
        at junit.framework.TestCase.runBare(TestCase.java:127)
        at junit.framework.TestResult$1.protect(TestResult.java:106)
        at junit.framework.TestResult.runProtected(TestResult.java:124)
        at junit.framework.TestResult.run(TestResult.java:109)
        at junit.framework.TestCase.run(TestCase.java:118)
        at junit.framework.TestSuite.runTest(TestSuite.java:208)
        at junit.framework.TestSuite.run(TestSuite.java:203)
        at sun.reflect.GeneratedMethodAccessor112.invoke(Unknown Source)
        at sun.reflect.DelegatingMethodAccessorImpl.invoke(DelegatingMethodAccessorImpl.java:25)
        at java.lang.reflect.Method.invoke(Method.java:597)
        at org.apache.maven.surefire.junit.JUnitTestSet.execute(JUnitTestSet.java:213)
        at org.apache.maven.surefire.suite.AbstractDirectoryTestSuite.executeTestSet(AbstractDirectoryTestSuite.java:138)
        at org.apache.maven.surefire.suite.AbstractDirectoryTestSuite.execute(AbstractDirectoryTestSuite.java:125)
        at org.apache.maven.surefire.Surefire.run(Surefire.java:132)
        at sun.reflect.NativeMethodAccessorImpl.invoke0(Native Method)
        at sun.reflect.NativeMethodAccessorImpl.invoke(NativeMethodAccessorImpl.java:39)
        at sun.reflect.DelegatingMethodAccessorImpl.invoke(DelegatingMethodAccessorImpl.java:25)
        at java.lang.reflect.Method.invoke(Method.java:597)
        at org.apache.maven.surefire.booter.SurefireBooter.runSuitesInProcess(SurefireBooter.java:290)
        at org.apache.maven.surefire.booter.SurefireBooter.main(SurefireBooter.java:818)
ERROR - ItemProvider.createEntry(199) | Unknown entry generation error: Failure mode
org.osaf.cosmo.atom.generator.GeneratorException: Failure mode
        at org.osaf.cosmo.atom.generator.mock.MockItemFeedGenerator.generateEntry(MockItemFeedGenerator.java:81)
        at org.osaf.cosmo.atom.provider.ItemProvider.createEntry(ItemProvider.java:161)
        at org.osaf.cosmo.atom.provider.CreateItemTest.testGenerationError(CreateItemTest.java:134)
        at sun.reflect.NativeMethodAccessorImpl.invoke0(Native Method)
        at sun.reflect.NativeMethodAccessorImpl.invoke(NativeMethodAccessorImpl.java:39)
        at sun.reflect.DelegatingMethodAccessorImpl.invoke(DelegatingMethodAccessorImpl.java:25)
        at java.lang.reflect.Method.invoke(Method.java:597)
        at junit.framework.TestCase.runTest(TestCase.java:154)
        at junit.framework.TestCase.runBare(TestCase.java:127)
        at junit.framework.TestResult$1.protect(TestResult.java:106)
        at junit.framework.TestResult.runProtected(TestResult.java:124)
        at junit.framework.TestResult.run(TestResult.java:109)
        at junit.framework.TestCase.run(TestCase.java:118)
        at junit.framework.TestSuite.runTest(TestSuite.java:208)
        at junit.framework.TestSuite.run(TestSuite.java:203)
        at sun.reflect.GeneratedMethodAccessor112.invoke(Unknown Source)
        at sun.reflect.DelegatingMethodAccessorImpl.invoke(DelegatingMethodAccessorImpl.java:25)
        at java.lang.reflect.Method.invoke(Method.java:597)
        at org.apache.maven.surefire.junit.JUnitTestSet.execute(JUnitTestSet.java:213)
        at org.apache.maven.surefire.suite.AbstractDirectoryTestSuite.executeTestSet(AbstractDirectoryTestSuite.java:138)
        at org.apache.maven.surefire.suite.AbstractDirectoryTestSuite.execute(AbstractDirectoryTestSuite.java:125)
        at org.apache.maven.surefire.Surefire.run(Surefire.java:132)
        at sun.reflect.NativeMethodAccessorImpl.invoke0(Native Method)
        at sun.reflect.NativeMethodAccessorImpl.invoke(NativeMethodAccessorImpl.java:39)
        at sun.reflect.DelegatingMethodAccessorImpl.invoke(DelegatingMethodAccessorImpl.java:25)
        at java.lang.reflect.Method.invoke(Method.java:597)
        at org.apache.maven.surefire.booter.SurefireBooter.runSuitesInProcess(SurefireBooter.java:290)
        at org.apache.maven.surefire.booter.SurefireBooter.main(SurefireBooter.java:818)
ERROR - CreateItemTest.testCreateMediaEvent(62) | 
Tests run: 7, Failures: 0, Errors: 0, Skipped: 0, Time elapsed: 0.112 sec
Running org.osaf.cosmo.calendar.ICalendarUtilsTest
Tests run: 4, Failures: 0, Errors: 0, Skipped: 0, Time elapsed: 0.059 sec
Running org.osaf.cosmo.cmp.CmpDeleteTest
Tests run: 5, Failures: 0, Errors: 0, Skipped: 0, Time elapsed: 0.003 sec
Running org.osaf.cosmo.model.NoteItemTest
Tests run: 1, Failures: 0, Errors: 0, Skipped: 0, Time elapsed: 0.002 sec
Running org.osaf.cosmo.service.lock.SingleVMLockManagerTest
Tests run: 1, Failures: 0, Errors: 0, Skipped: 0, Time elapsed: 0.713 sec
Running org.osaf.cosmo.atom.provider.GetUserServiceTest
ERROR - UserProvider.getService(70) | Unknown service generation error: Failure mode
org.osaf.cosmo.atom.generator.GeneratorException: Failure mode
        at org.osaf.cosmo.atom.generator.mock.MockServiceGenerator.generateService(MockServiceGenerator.java:55)
        at org.osaf.cosmo.atom.provider.UserProvider.getService(UserProvider.java:64)
        at org.osaf.cosmo.atom.provider.GetUserServiceTest.testGenerationError(GetUserServiceTest.java:48)
        at sun.reflect.NativeMethodAccessorImpl.invoke0(Native Method)
        at sun.reflect.NativeMethodAccessorImpl.invoke(NativeMethodAccessorImpl.java:39)
        at sun.reflect.DelegatingMethodAccessorImpl.invoke(DelegatingMethodAccessorImpl.java:25)
        at java.lang.reflect.Method.invoke(Method.java:597)
        at junit.framework.TestCase.runTest(TestCase.java:154)
        at junit.framework.TestCase.runBare(TestCase.java:127)
        at junit.framework.TestResult$1.protect(TestResult.java:106)
        at junit.framework.TestResult.runProtected(TestResult.java:124)
        at junit.framework.TestResult.run(TestResult.java:109)
        at junit.framework.TestCase.run(TestCase.java:118)
        at junit.framework.TestSuite.runTest(TestSuite.java:208)
        at junit.framework.TestSuite.run(TestSuite.java:203)
        at sun.reflect.GeneratedMethodAccessor112.invoke(Unknown Source)
        at sun.reflect.DelegatingMethodAccessorImpl.invoke(DelegatingMethodAccessorImpl.java:25)
        at java.lang.reflect.Method.invoke(Method.java:597)
        at org.apache.maven.surefire.junit.JUnitTestSet.execute(JUnitTestSet.java:213)
        at org.apache.maven.surefire.suite.AbstractDirectoryTestSuite.executeTestSet(AbstractDirectoryTestSuite.java:138)
        at org.apache.maven.surefire.suite.AbstractDirectoryTestSuite.execute(AbstractDirectoryTestSuite.java:125)
        at org.apache.maven.surefire.Surefire.run(Surefire.java:132)
        at sun.reflect.NativeMethodAccessorImpl.invoke0(Native Method)
        at sun.reflect.NativeMethodAccessorImpl.invoke(NativeMethodAccessorImpl.java:39)
        at sun.reflect.DelegatingMethodAccessorImpl.invoke(DelegatingMethodAccessorImpl.java:25)
        at java.lang.reflect.Method.invoke(Method.java:597)
        at org.apache.maven.surefire.booter.SurefireBooter.runSuitesInProcess(SurefireBooter.java:290)
        at org.apache.maven.surefire.booter.SurefireBooter.main(SurefireBooter.java:818)
Tests run: 2, Failures: 0, Errors: 0, Skipped: 0, Time elapsed: 0.469 sec
Running org.osaf.cosmo.model.CalendarAttributeTest
Tests run: 1, Failures: 0, Errors: 0, Skipped: 0, Time elapsed: 0.009 sec
Running org.osaf.cosmo.atom.provider.CreateCollectionTest
Tests run: 7, Failures: 0, Errors: 0, Skipped: 0, Time elapsed: 0.095 sec
Running org.osaf.cosmo.dao.hibernate.query.CalendarFilterConverterTest
Tests run: 2, Failures: 0, Errors: 0, Skipped: 0, Time elapsed: 0.002 sec
Running org.osaf.cosmo.atom.provider.GetSubscriptionTest
ERROR - SubscriptionProvider.getEntry(211) | Unknown entry generation error: Failure mode
org.osaf.cosmo.atom.generator.GeneratorException: Failure mode
        at org.osaf.cosmo.atom.generator.mock.MockSubscriptionFeedGenerator.generateEntry(MockSubscriptionFeedGenerator.java:70)
        at org.osaf.cosmo.atom.provider.SubscriptionProvider.getEntry(SubscriptionProvider.java:206)
        at org.osaf.cosmo.atom.provider.GetSubscriptionTest.testGenerationError(GetSubscriptionTest.java:49)
        at sun.reflect.NativeMethodAccessorImpl.invoke0(Native Method)
        at sun.reflect.NativeMethodAccessorImpl.invoke(NativeMethodAccessorImpl.java:39)
        at sun.reflect.DelegatingMethodAccessorImpl.invoke(DelegatingMethodAccessorImpl.java:25)
        at java.lang.reflect.Method.invoke(Method.java:597)
        at junit.framework.TestCase.runTest(TestCase.java:154)
        at junit.framework.TestCase.runBare(TestCase.java:127)
        at junit.framework.TestResult$1.protect(TestResult.java:106)
        at junit.framework.TestResult.runProtected(TestResult.java:124)
        at junit.framework.TestResult.run(TestResult.java:109)
        at junit.framework.TestCase.run(TestCase.java:118)
        at junit.framework.TestSuite.runTest(TestSuite.java:208)
        at junit.framework.TestSuite.run(TestSuite.java:203)
        at sun.reflect.GeneratedMethodAccessor112.invoke(Unknown Source)
        at sun.reflect.DelegatingMethodAccessorImpl.invoke(DelegatingMethodAccessorImpl.java:25)
        at java.lang.reflect.Method.invoke(Method.java:597)
        at org.apache.maven.surefire.junit.JUnitTestSet.execute(JUnitTestSet.java:213)
        at org.apache.maven.surefire.suite.AbstractDirectoryTestSuite.executeTestSet(AbstractDirectoryTestSuite.java:138)
        at org.apache.maven.surefire.suite.AbstractDirectoryTestSuite.execute(AbstractDirectoryTestSuite.java:125)
        at org.apache.maven.surefire.Surefire.run(Surefire.java:132)
        at sun.reflect.NativeMethodAccessorImpl.invoke0(Native Method)
        at sun.reflect.NativeMethodAccessorImpl.invoke(NativeMethodAccessorImpl.java:39)
        at sun.reflect.DelegatingMethodAccessorImpl.invoke(DelegatingMethodAccessorImpl.java:25)
        at java.lang.reflect.Method.invoke(Method.java:597)
        at org.apache.maven.surefire.booter.SurefireBooter.runSuitesInProcess(SurefireBooter.java:290)
        at org.apache.maven.surefire.booter.SurefireBooter.main(SurefireBooter.java:818)
Tests run: 2, Failures: 0, Errors: 0, Skipped: 0, Time elapsed: 0.009 sec
Running org.osaf.cosmo.calendar.EntityConverterTest
Tests run: 2, Failures: 0, Errors: 0, Skipped: 0, Time elapsed: 0.425 sec
Running org.osaf.cosmo.atom.provider.UpdateItemMediaTest
ERROR - UpdateItemMediaTest.testUpdateMedia(38) | content-type: text/plain
ERROR - UpdateItemMediaTest.testUpdateMedia(41) | 
ERROR - ItemProvider.updateMedia(326) | Unknown content processing error: Failure mode
org.osaf.cosmo.atom.processor.ProcessorException: Failure mode
        at org.osaf.cosmo.atom.processor.mock.MockContentProcessor.processContent(MockContentProcessor.java:94)
        at org.osaf.cosmo.atom.provider.ItemProvider.updateMedia(ItemProvider.java:307)
        at org.osaf.cosmo.atom.provider.UpdateItemMediaTest.testProcessingError(UpdateItemMediaTest.java:79)
        at sun.reflect.NativeMethodAccessorImpl.invoke0(Native Method)
        at sun.reflect.NativeMethodAccessorImpl.invoke(NativeMethodAccessorImpl.java:39)
        at sun.reflect.DelegatingMethodAccessorImpl.invoke(DelegatingMethodAccessorImpl.java:25)
        at java.lang.reflect.Method.invoke(Method.java:597)
        at junit.framework.TestCase.runTest(TestCase.java:154)
        at junit.framework.TestCase.runBare(TestCase.java:127)
        at junit.framework.TestResult$1.protect(TestResult.java:106)
        at junit.framework.TestResult.runProtected(TestResult.java:124)
        at junit.framework.TestResult.run(TestResult.java:109)
        at junit.framework.TestCase.run(TestCase.java:118)
        at junit.framework.TestSuite.runTest(TestSuite.java:208)
        at junit.framework.TestSuite.run(TestSuite.java:203)
        at sun.reflect.GeneratedMethodAccessor112.invoke(Unknown Source)
        at sun.reflect.DelegatingMethodAccessorImpl.invoke(DelegatingMethodAccessorImpl.java:25)
        at java.lang.reflect.Method.invoke(Method.java:597)
        at org.apache.maven.surefire.junit.JUnitTestSet.execute(JUnitTestSet.java:213)
        at org.apache.maven.surefire.suite.AbstractDirectoryTestSuite.executeTestSet(AbstractDirectoryTestSuite.java:138)
        at org.apache.maven.surefire.suite.AbstractDirectoryTestSuite.execute(AbstractDirectoryTestSuite.java:125)
        at org.apache.maven.surefire.Surefire.run(Surefire.java:132)
        at sun.reflect.NativeMethodAccessorImpl.invoke0(Native Method)
        at sun.reflect.NativeMethodAccessorImpl.invoke(NativeMethodAccessorImpl.java:39)
        at sun.reflect.DelegatingMethodAccessorImpl.invoke(DelegatingMethodAccessorImpl.java:25)
        at java.lang.reflect.Method.invoke(Method.java:597)
        at org.apache.maven.surefire.booter.SurefireBooter.runSuitesInProcess(SurefireBooter.java:290)
        at org.apache.maven.surefire.booter.SurefireBooter.main(SurefireBooter.java:818)
Tests run: 4, Failures: 0, Errors: 0, Skipped: 0, Time elapsed: 0.022 sec

Results :

Tests in error: 
  testGetUsers(org.osaf.cosmo.cmp.CmpGetTest)
  testGetUser(org.osaf.cosmo.cmp.CmpGetTest)
  testGetAccount(org.osaf.cosmo.cmp.CmpGetTest)
  testGetOverlord(org.osaf.cosmo.cmp.CmpGetTest)

Tests run: 479, Failures: 0, Errors: 4, Skipped: 0