rendered paste bodymake[2]: Entering directory `/data/kde/trunk/KDE/kdebindings/build-gcc'
/usr/local/bin/cmake -E cmake_progress_report /data/kde/trunk/KDE/kdebindings/build-gcc/CMakeFiles 17
[ 1%] Generating smokedata.cpp, x_1.cpp, x_2.cpp, x_3.cpp, x_4.cpp, x_5.cpp, x_6.cpp, x_7.cpp, x_8.cpp, x_9.cpp, x_10.cpp, x_11.cpp, x_12.cpp, x_13.cpp, x_14.cpp, x_15.cpp, x_16.cpp, x_17.cpp, x_18.cpp, x_19.cpp, x_20.cpp
cd /data/kde/trunk/KDE/kdebindings/build-gcc/smoke/qt && /usr/bin/perl /data/kde/trunk/KDE/kdebindings/build-gcc/smoke/qt/qtguess.pl
Checking how Qt was built...
Threshold is set to 10
Number of defines to be tested : 45/78
Found 22 predefined symbols in qglobal.h
Trying to compile and link a small program... OK
Testing QT_NO_DRAWUTIL *Undefined*
Testing QT_NO_DIAL *Undefined*
Testing QT_NO_SIZEGRIP *Undefined*
Testing QT_NO_WHATSTHIS *Undefined*
Testing QT_NO_LABEL *Undefined*
Testing QT_NO_FRAME *Undefined*
Testing QT_NO_LAYOUT *Undefined*
Testing QT_NO_TOOLBAR *Undefined*
Testing QT_NO_TABWIDGET *Undefined*
Testing QT_NO_COMBOBOX *Undefined*
Testing QT_NO_CHECKBOX *Undefined*
Testing QT_NO_TOOLTIP *Undefined*
Testing QT_NO_TABBAR *Undefined*
Testing QT_NO_SCROLLBAR *Undefined*
Testing QT_NO_DATETIMEEDIT *Undefined*
Testing QT_NO_RADIOBUTTON *Undefined*
Testing QT_NO_SLIDER *Undefined*
Testing QT_NO_PROGRESSBAR *Undefined*
Testing QT_NO_PUSHBUTTON *Undefined*
Testing QT_NO_COLORDIALOG *Undefined*
Testing QT_NO_FONTDIALOG *Undefined*
Testing QT_NO_BUTTONGROUP *Undefined*
Testing QT_NO_GROUPBOX *Undefined*
Testing QT_NO_DIALOG *Undefined*
Testing QT_NO_LCDNUMBER *Undefined*
Testing QT_NO_LINEEDIT *Undefined*
Testing QT_NO_TOOLBUTTON *Undefined*
Testing QT_NO_LISTVIEW *Undefined*
Testing QT_NO_MAINWINDOW *Undefined*
Testing QT_NO_FILEDIALOG *Undefined*
Testing QT_NO_PRINTDIALOG *Undefined*
Testing QT_NO_TEXTEDIT *Undefined*
Testing QT_NO_ERRORMESSAGE *Undefined*
Testing QT_NO_MENUBAR *Undefined*
Testing QT_NO_MESSAGEBOX *Undefined*
Testing QT_NO_PROGRESSDIALOG *Undefined*
Testing QT_NO_TEXTBROWSER *Undefined*
Testing QT_NO_SESSIONMANAGER *Undefined*
Testing QT_NO_ACCESSIBILITY *Undefined*
Testing QT_NO_TABLEVIEW *Undefined*
Testing QT_NO_STYLE_MAC [Defined]
Testing QT_NO_STYLE_WINDOWS *Undefined*
Testing QT_NO_STYLE_WINDOWSXP [Defined]
Testing QT_NO_STYLE_PLASTIQUE *Undefined*
Testing QT_NO_STYLE_CLEANLOOKS *Undefined*
24 defines found.
cd /data/kde/trunk/KDE/kdebindings/build-gcc/smoke/qt && /usr/bin/perl /data/kde/trunk/KDE/kdebindings/build-gcc/smoke/qt/generate.pl
Found 'qtdefines'. Reading preprocessor symbols from there...
Can't read from /data/kde/trunk/qt-copy/include/QtDBus/../tools/qdbus/src/qdbusargument.h at/data/kde/trunk/KDE/kdebindings/kalyptus/kalyptus line 329
main::parseFiles() called at /data/kde/trunk/KDE/kdebindings/kalyptus/kalyptus line 259
make[2]: *** [smoke/qt/smokedata.cpp] Error 2
make[2]: Leaving directory `/data/kde/trunk/KDE/kdebindings/build-gcc'
make[1]: *** [smoke/qt/CMakeFiles/smokeqt.dir/all] Error 2
make[1]: Leaving directory `/data/kde/trunk/KDE/kdebindings/build-gcc'
make: *** [all] Error 2
===== Finished Building KDE/kdebindings =====
===== Finished Installing KDE =====