make -C /lib/modules/2.6.24-rc3-zen4/build M=/usr/src/ipwraw-ng modules
make[1]: Entering directory `/usr/src/linux-2.6.24-rc3-zen4'
CC [M] /usr/src/ipwraw-ng/ipwraw.o
/usr/src/ipwraw-ng/ipwraw.c: In function ‘store_bssid’:
/usr/src/ipwraw-ng/ipwraw.c:1500: error: implicit declaration of function ‘MAC_ARG’
/usr/src/ipwraw-ng/ipwraw.c:1500: warning: too few arguments for format
/usr/src/ipwraw-ng/ipwraw.c:1506: warning: too few arguments for format
/usr/src/ipwraw-ng/ipwraw.c: In function ‘show_bssid’:
/usr/src/ipwraw-ng/ipwraw.c:1516: warning: too few arguments for format
/usr/src/ipwraw-ng/ipwraw.c: In function ‘ipw_print_rx_config’:
/usr/src/ipwraw-ng/ipwraw.c:2565: warning: too few arguments for format
/usr/src/ipwraw-ng/ipwraw.c:2567: warning: too few arguments for format
/usr/src/ipwraw-ng/ipwraw.c: In function ‘tx_skb’:
/usr/src/ipwraw-ng/ipwraw.c:7421: warning: too few arguments for format
/usr/src/ipwraw-ng/ipwraw.c: In function ‘ipw_net_set_mac_address’:
/usr/src/ipwraw-ng/ipwraw.c:7610: warning: too few arguments for format
/usr/src/ipwraw-ng/ipwraw.c: In function ‘ipw_up’:
/usr/src/ipwraw-ng/ipwraw.c:8081: warning: too few arguments for format
/usr/src/ipwraw-ng/ipwraw.c: In function ‘ipw_pci_probe’:
/usr/src/ipwraw-ng/ipwraw.c:8737: error: ‘SA_SHIRQ’ undeclared (first use in this function)
/usr/src/ipwraw-ng/ipwraw.c:8737: error: (Each undeclared identifier is reported only once
/usr/src/ipwraw-ng/ipwraw.c:8737: error: for each function it appears in.)
/usr/src/ipwraw-ng/ipwraw.c:8743: error: implicit declaration of function ‘SET_MODULE_OWNER’
make[2]: *** [/usr/src/ipwraw-ng/ipwraw.o] Error 1
make[1]: *** [_module_/usr/src/ipwraw-ng] Error 2
make[1]: Leaving directory `/usr/src/linux-2.6.24-rc3-zen4'
make: *** [modules] Error 2