rendered paste body| ccache arm-angstrom-linux-gnueabi-g++ -march=armv4t -mtune=arm920t -DHAVE_CONFIG_H -I. -I. -I. -isystem/home/qvantel/moko/build/tmp/staging/arm-angstrom-linux-gnueabi/include -isystem/home/qvantel/moko/build/tmp/staging/arm-angstrom-linux-gnueabi/include -fexpensive-optimizations -fomit-frame-pointer -frename-registers -Os -fpermissive -fvisibility-inlines-hidden -c autosprintf.cc -fPIC -DPIC -o .libs/autosprintf.o
| In file included from /home/qvantel/moko/build/tmp/staging/arm-angstrom-linux-gnueabi/include/c++/string:52,
| from autosprintf.h:36,
| from autosprintf.cc:29:
| /home/qvantel/moko/build/tmp/staging/arm-angstrom-linux-gnueabi/include/c++/bits/stl_function.h:205: error: stray '\32' in program
| make[5]: *** [autosprintf.lo] Error 1
| make[5]: Leaving directory `/home/qvantel/moko/build/tmp/work/armv4t-angstrom-linux-gnueabi/gettext-0.14.1-r6/gettext-0.14.1/gettext-runtime/libasprintf'
| make[4]: *** [all] Error 2
| make[4]: Leaving directory `/home/qvantel/moko/build/tmp/work/armv4t-angstrom-linux-gnueabi/gettext-0.14.1-r6/gettext-0.14.1/gettext-runtime/libasprintf'
| make[3]: *** [all-recursive] Error 1
| make[3]: Leaving directory `/home/qvantel/moko/build/tmp/work/armv4t-angstrom-linux-gnueabi/gettext-0.14.1-r6/gettext-0.14.1/gettext-runtime'
| make[2]: *** [all] Error 2
| make[2]: Leaving directory `/home/qvantel/moko/build/tmp/work/armv4t-angstrom-linux-gnueabi/gettext-0.14.1-r6/gettext-0.14.1/gettext-runtime'
| make[1]: *** [all-recursive] Error 1
| make[1]: Leaving directory `/home/qvantel/moko/build/tmp/work/armv4t-angstrom-linux-gnueabi/gettext-0.14.1-r6/gettext-0.14.1'
| FATAL: oe_runmake failed
NOTE: Task failed: /home/qvantel/moko/build/tmp/work/armv4t-angstrom-linux-gnueabi/gettext-0.14.1-r6/temp/log.do_compile.32671
NOTE: package gettext-0.14.1-r6: task do_compile: failed
ERROR: TaskFailed event exception, aborting
NOTE: package gettext-0.14.1: failed
ERROR: Build of /home/qvantel/moko/openembedded/packages/gettext/gettext_0.14.1.bb do_compile failed
ERROR: Task 2717 (/home/qvantel/moko/openembedded/packages/gettext/gettext_0.14.1.bb, do_compile) failed
NOTE: Tasks Summary: Attempted 2199 tasks of which 127 didn't need to be rerun and 1 failed.
ERROR: '/home/qvantel/moko/openembedded/packages/gettext/gettext_0.14.1.bb' failed
make: *** [openmoko-devel-image] Error 1
qvantel@qvantel-desktop:~/moko$ make openmoko-devel-image