rendered paste body| mkdir .libs
| ccache gcc -isystem/home/henrik/OM/build/tmp/staging/i686-linux/include -Os -Wl,-rpath-link -Wl,/home/henrik/OM/build/tmp/staging/i686-linux/lib -Wl,-rpath -Wl,/home/henrik/OM/build/tmp/staging/i686-linux/lib -Wl,-O1 -o .libs/curl main.o hugehelp.o urlglob.o writeout.o writeenv.o getpass.o homedir.o curlutil.o strtoofft.o strdup.o -L/home/henrik/OM/build/tmp/staging/i686-linux/lib -L/home/henrik/OM/build/tmp/staging/i686-linux/lib/..//lib ../lib/.libs/libcurl.so /usr/lib/gcc/i486-linux-gnu/4.2.3/../../../../lib//libidn.so -lssh2 -ldl /home/henrik/OM/build/tmp/staging/i686-linux/lib/libz.so -Wl,--rpath -Wl,/home/henrik/OM/build/tmp/staging/i686-linux/lib -Wl,--rpath -Wl,/usr/lib/gcc/i486-linux-gnu/4.2.3/../../../../lib/
| ../lib/.libs/libcurl.so: undefined reference to `libssh2_channel_writenb'
| ../lib/.libs/libcurl.so: undefined reference to `libssh2_sftp_readnb'
| ../lib/.libs/libcurl.so: undefined reference to `libssh2_sftp_writenb'
| ../lib/.libs/libcurl.so: undefined reference to `libssh2_channel_readnb'
| collect2: ld returned 1 exit status
| make[3]: *** [curl] Error 1
| make[3]: Leaving directory `/home/henrik/OM/build/tmp/work/i686-linux/curl-native-7.16.4-r0/curl-7.16.4/src'
| make[2]: *** [all] Error 2
| make[2]: Leaving directory `/home/henrik/OM/build/tmp/work/i686-linux/curl-native-7.16.4-r0/curl-7.16.4/src'
| make[1]: *** [all-recursive] Error 1
| make[1]: Leaving directory `/home/henrik/OM/build/tmp/work/i686-linux/curl-native-7.16.4-r0/curl-7.16.4'
| FATAL: oe_runmake failed
NOTE: Task failed: /home/henrik/OM/build/tmp/work/i686-linux/curl-native-7.16.4-r0/temp/log.do_compile.21166
NOTE: package curl-native-7.16.4-r0: task do_compile: failed
ERROR: TaskFailed event exception, aborting
NOTE: package curl-native-7.16.4: failed
ERROR: Build of /home/henrik/OM/openembedded/packages/curl/curl-native_7.16.4.bb do_compile failed
ERROR: Task 1739 (/home/henrik/OM/openembedded/packages/curl/curl-native_7.16.4.bb, do_compile) failed
NOTE: Tasks Summary: Attempted 741 tasks of which 736 didn't need to be rerun and 1 failed.
ERROR: '/home/henrik/OM/openembedded/packages/curl/curl-native_7.16.4.bb' failed
make: *** [openmoko-devel-image] Error 1