Compilation started at Tue Dec 11 20:59:13
make all
make all-am
make[1]: Entering directory `/home/catap/work/dashik/mpi'
mpicc -DHAVE_CONFIG_H -I. -g -MT mpi.o -MD -MP -MF .deps/mpi.Tpo -c -o mpi.o mpi.c
mpi.c:41: error: ‘gamma’ redeclared as different kind of symbol
mpi.c: In function ‘dv’:
mpi.c:61: error: expected ‘)’ before ‘;’ token
mpi.c:62: error: expected ‘;’ before ‘}’ token
mpi.c: In function ‘ident_oblast’:
mpi.c:67: error: ‘hy’ undeclared (first use in this function)
mpi.c:67: error: (Each undeclared identifier is reported only once
mpi.c:67: error: for each function it appears in.)
mpi.c: In function ‘create_first_step’:
mpi.c:78: error: ‘config’ undeclared (first use in this function)
mpi.c:80: error: ‘smeshX’ undeclared (first use in this function)
mpi.c:81: error: ‘smeshY’ undeclared (first use in this function)
mpi.c:82: error: ‘hx’ undeclared (first use in this function)
mpi.c:82: error: ‘hy’ undeclared (first use in this function)
mpi.c:83: error: ‘for’ loop initial declaration used outside C99 mode
mpi.c:85: error: ‘for’ loop initial declaration used outside C99 mode
mpi.c:87: error: ‘p’ undeclared (first use in this function)
mpi.c:88: error: expected expression before ‘||’ token
mpi.c: In function ‘real_calc’:
mpi.c:128: error: ‘for’ loop initial declaration used outside C99 mode
mpi.c:130: error: ‘for’ loop initial declaration used outside C99 mode
mpi.c:139: error: ‘complex_ro’ undeclared (first use in this function)
mpi.c:141: error: invalid operands to binary *
mpi.c:141: error: invalid operands to binary *
mpi.c:141: error: invalid operands to binary *
mpi.c:141: error: invalid operands to binary *
mpi.c:142: error: invalid operands to binary *
mpi.c:142: error: invalid operands to binary *
mpi.c:142: error: invalid operands to binary *
mpi.c:142: error: invalid operands to binary *
mpi.c:143: error: invalid operands to binary *
mpi.c:143: error: invalid operands to binary *
mpi.c:143: error: invalid operands to binary *
mpi.c:143: error: invalid operands to binary *
mpi.c:144: error: invalid operands to binary *
mpi.c:144: error: invalid operands to binary *
mpi.c:144: error: invalid operands to binary *
mpi.c:144: error: invalid operands to binary *
mpi.c:145: error: invalid operands to binary *
mpi.c:145: error: invalid operands to binary /
mpi.c:147: error: invalid operands to binary *
mpi.c:147: error: invalid operands to binary *
mpi.c:147: error: invalid operands to binary *
mpi.c:147: error: invalid operands to binary *
mpi.c:148: error: invalid operands to binary *
mpi.c:148: error: invalid operands to binary *
mpi.c:148: error: invalid operands to binary *
mpi.c:148: error: invalid operands to binary *
mpi.c:149: error: invalid operands to binary *
mpi.c:149: error: invalid operands to binary *
mpi.c:149: error: invalid operands to binary *
mpi.c:149: error: invalid operands to binary *
mpi.c:150: error: invalid operands to binary *
mpi.c:150: error: invalid operands to binary *
mpi.c:150: error: invalid operands to binary *
mpi.c:150: error: invalid operands to binary *
mpi.c:151: error: invalid operands to binary *
mpi.c:151: error: invalid operands to binary /
mpi.c:153: error: invalid operands to binary *
mpi.c:153: error: invalid operands to binary *
mpi.c:154: error: expected ‘,’ or ‘;’ before ‘a1’
mpi.c:155: error: invalid operands to binary *
mpi.c:155: error: invalid operands to binary *
mpi.c:155: error: invalid operands to binary *
mpi.c:155: error: invalid operands to binary *
mpi.c:156: error: invalid operands to binary *
mpi.c:156: error: invalid operands to binary *
mpi.c:156: error: invalid operands to binary *
mpi.c:156: error: invalid operands to binary *
mpi.c:157: error: invalid operands to binary *
mpi.c:157: error: invalid operands to binary *
mpi.c:157: error: invalid operands to binary *
mpi.c:157: error: invalid operands to binary *
mpi.c:158: error: invalid operands to binary /
mpi.c:158: error: invalid operands to binary +
mpi.c:158: error: invalid operands to binary /
mpi.c:160: error: invalid operands to binary *
mpi.c:160: error: invalid operands to binary *
mpi.c:162: error: invalid operands to binary *
mpi.c: In function ‘first_send’:
mpi.c:184: error: ‘Kx’ undeclared (first use in this function)
mpi.c:187: error: ‘for’ loop initial declaration used outside C99 mode
mpi.c:200: error: redefinition of ‘j’
mpi.c:187: error: previous definition of ‘j’ was here
mpi.c:200: error: ‘for’ loop initial declaration used outside C99 mode
mpi.c:210: error: ‘Ky’ undeclared (first use in this function)
mpi.c:213: error: ‘for’ loop initial declaration used outside C99 mode
mpi.c:226: error: redefinition of ‘i’
mpi.c:213: error: previous definition of ‘i’ was here
mpi.c:226: error: ‘for’ loop initial declaration used outside C99 mode
mpi.c:242: error: redefinition of ‘j’
mpi.c:200: error: previous definition of ‘j’ was here
mpi.c:242: error: ‘for’ loop initial declaration used outside C99 mode
mpi.c:245: error: lvalue required as unary ‘&’ operand
mpi.c:246: error: lvalue required as unary ‘&’ operand
mpi.c:256: error: redefinition of ‘j’
mpi.c:242: error: previous definition of ‘j’ was here
mpi.c:256: error: ‘for’ loop initial declaration used outside C99 mode
mpi.c:259: error: lvalue required as unary ‘&’ operand
mpi.c:260: error: lvalue required as unary ‘&’ operand
mpi.c:270: error: redefinition of ‘i’
mpi.c:226: error: previous definition of ‘i’ was here
mpi.c:270: error: ‘for’ loop initial declaration used outside C99 mode
mpi.c:273: error: lvalue required as unary ‘&’ operand
mpi.c:274: error: lvalue required as unary ‘&’ operand
mpi.c:284: error: redefinition of ‘i’
mpi.c:270: error: previous definition of ‘i’ was here
mpi.c:284: error: ‘for’ loop initial declaration used outside C99 mode
mpi.c:287: error: lvalue required as unary ‘&’ operand
mpi.c:288: error: lvalue required as unary ‘&’ operand
mpi.c: In function ‘get_data’:
mpi.c:301: error: ‘for’ loop initial declaration used outside C99 mode
mpi.c:301: error: ‘Kx’ undeclared (first use in this function)
mpi.c:301: error: ‘Ky’ undeclared (first use in this function)
mpi.c:303: error: ‘smeshX’ undeclared (first use in this function)
mpi.c:304: error: ‘smeshY’ undeclared (first use in this function)
mpi.c:305: error: ‘for’ loop initial declaration used outside C99 mode
mpi.c:307: error: ‘for’ loop initial declaration used outside C99 mode
mpi.c:321: error: ‘for’ loop initial declaration used outside C99 mode
mpi.c:323: error: ‘for’ loop initial declaration used outside C99 mode
mpi.c: In function ‘write_to_log’:
mpi.c:351: error: ‘struct Config’ has no member named ‘nx’
mpi.c:353: error: ‘struct Config’ has no member named ‘ny’
mpi.c:355: error: ‘global’ undeclared (first use in this function)
mpi.c: In function ‘calc’:
mpi.c:368: error: ‘for’ loop initial declaration used outside C99 mode
mpi.c:368: error: ‘Nt’ undeclared (first use in this function)
mpi.c:371: error: ‘for’ loop initial declaration used outside C99 mode
mpi.c:373: error: ‘for’ loop initial declaration used outside C99 mode
mpi.c:386: error: too few arguments to function ‘real_calc’
mpi.c: In function ‘init’:
mpi.c:437: error: ‘Nx’ undeclared (first use in this function)
mpi.c:437: error: ‘Ny’ undeclared (first use in this function)
mpi.c:445: error: ‘struct Config’ has no member named ‘nx’
mpi.c:445: error: ‘struct Config’ has no member named ‘ny’
mpi.c:446: error: ‘struct Config’ has no member named ‘nx’
mpi.c:446: error: ‘struct Config’ has no member named ‘ny’
mpi.c:447: error: ‘struct Config’ has no member named ‘nx’
mpi.c:447: error: ‘struct Config’ has no member named ‘ny’
mpi.c:448: error: ‘struct Config’ has no member named ‘nx’
mpi.c:448: error: ‘struct Config’ has no member named ‘ny’
mpi.c:449: error: ‘struct Config’ has no member named ‘nx’
mpi.c:449: error: ‘struct Config’ has no member named ‘ny’
mpi.c:450: error: ‘struct Config’ has no member named ‘nx’
mpi.c:450: error: ‘struct Config’ has no member named ‘ny’
mpi.c:455: error: ‘struct Config’ has no member named ‘nx’
mpi.c:455: error: ‘struct Config’ has no member named ‘ny’
mpi.c: In function ‘fin’:
mpi.c:478: error: ‘complex_local’ undeclared (first use in this function)
mpi.c:478: error: ‘struct Config’ has no member named ‘nx’
mpi.c:483: error: ‘global’ undeclared (first use in this function)
mpi.c:483: error: ‘struct Config’ has no member named ‘nx’
mpi.c: At top level:
mpi.c:548: warning: conflicting types for ‘create_parameters’
mpi.c:366: warning: previous implicit declaration of ‘create_parameters’ was here
mpi.c: In function ‘create_parameters’:
mpi.c:550: error: incompatible types in assignment
mpi.c:551: error: incompatible types in assignment
mpi.c:552: error: incompatible types in assignment
mpi.c:553: error: incompatible types in assignment
mpi.c:554: error: incompatible types in assignment
mpi.c:555: error: subscripted value is neither array nor pointer
mpi.c:556: error: subscripted value is neither array nor pointer
mpi.c:557: error: subscripted value is neither array nor pointer
mpi.c:558: error: subscripted value is neither array nor pointer
mpi.c:559: error: subscripted value is neither array nor pointer
mpi.c:560: error: subscripted value is neither array nor pointer
mpi.c:561: error: ‘for’ loop initial declaration used outside C99 mode
mpi.c:563: error: subscripted value is neither array nor pointer
mpi.c:564: error: subscripted value is neither array nor pointer
mpi.c:564: error: subscripted value is neither array nor pointer
mpi.c:564: error: subscripted value is neither array nor pointer
mpi.c:564: error: subscripted value is neither array nor pointer
mpi.c:564: error: subscripted value is neither array nor pointer
mpi.c:564: error: subscripted value is neither array nor pointer
mpi.c:566: error: subscripted value is neither array nor pointer
mpi.c:567: error: subscripted value is neither array nor pointer
mpi.c:568: error: subscripted value is neither array nor pointer
mpi.c:569: error: subscripted value is neither array nor pointer
mpi.c:569: error: subscripted value is neither array nor pointer
mpi.c:570: error: subscripted value is neither array nor pointer
mpi.c:570: error: subscripted value is neither array nor pointer
make[1]: *** [mpi.o] Ошибка 1
make[1]: Leaving directory `/home/catap/work/dashik/mpi'
make: *** [all] Ошибка 2
Compilation exited abnormally with code 2 at Tue Dec 11 20:59:16