All pastes #812723 Raw Edit

Mine

public text v1 · immutable
·published 2007-12-11 23:51 UTC
rendered paste body
make[1]: Entering directory `/home/mpfister/fdosvn/Thirdparty/GDAL1.3/src/ogr'
/bin/sh ../libtool --mode=compile g++ -Wall  -O2   -Iogrsf_frmts -I. -I../port -I../gcore -I../alg -I../ogr -I../ogr/ogrsf_frmts   -DHAVE_GEOS=1 -I/usr/local/include -I../port  -c -o ogrgeometryfactory.o ogrgeometryfactory.cpp
mkdir .libs
 g++ -Wall -O2 -Iogrsf_frmts -I. -I../port -I../gcore -I../alg -I../ogr -I../ogr/ogrsf_frmts -DHAVE_GEOS=1 -I/usr/local/include -I../port -c ogrgeometryfactory.cpp  -fPIC -DPIC -o .libs/ogrgeometryfactory.o
In file included from ogr_geos.h:41,
                 from ogrgeometryfactory.cpp:118:
/usr/local/include/geos/geom.h:145:2: warning: #warning *** FIXME: to be removed, temporarly set to allow a quick successful build
In file included from ogr_geos.h:42,
                 from ogrgeometryfactory.cpp:118:
/usr/local/include/geos/io.h:61:2: warning: #warning *** FIXME: to be removed, temporarly set to allow a quick successful build
ogrgeometryfactory.cpp: In static member function 'static OGRGeometry* OGRGeometryFactory::createFromGEOS(const geos::Geometry*)':
ogrgeometryfactory.cpp:827: error: 'WKTWriter' is not a member of 'geos'
ogrgeometryfactory.cpp:827: error: expected `;' before 'oWKTWriter'
ogrgeometryfactory.cpp:832: error: 'oWKTWriter' was not declared in this scope
ogrgeometryfactory.cpp:834: error: expected type-specifier
ogrgeometryfactory.cpp:834: error: expected unqualified-id before '*' token
ogrgeometryfactory.cpp:834: error: expected `)' before '*' token
ogrgeometryfactory.cpp:834: error: expected `{' before '*' token
ogrgeometryfactory.cpp:834: error: 'e' was not declared in this scope
ogrgeometryfactory.cpp:834: error: expected `;' before ')' token
ogrgeometryfactory.cpp: In static member function 'static geos::GeometryFactory* OGRGeometryFactory::getGEOSGeometryFactory()':
ogrgeometryfactory.cpp:871: error: invalid use of undefined type 'struct geos::GeometryFactory'
ogr_geometry.h:234: error: forward declaration of 'struct geos::GeometryFactory'
make[1]: *** [ogrgeometryfactory.o] Error 1
make[1]: Leaving directory `/home/mpfister/fdosvn/Thirdparty/GDAL1.3/src/ogr'
make: *** [ogr-target] Error 2
cp: cannot stat `./.libs/libgdal.a': No such file or directory
cp: cannot stat `./.libs/libgdal.so': No such file or directory
cp: cannot stat `./.libs/libgdal.so.1': No such file or directory
cp: cannot stat `./.libs/libgdal.so.1.9.0': No such file or directory
make[1]: Entering directory `/home/mpfister/fdosvn/Thirdparty'
make[1]: *** No rule to make target `GDAL1.3/linux/lib/optimized/libgdal.so.1.9.0', needed by `all-am'.  Stop.
make[1]: Leaving directory `/home/mpfister/fdosvn/Thirdparty'
make: *** [install-recursive] Error 1