All pastes #812205 Raw Edit

Miscellany

public text v1 · immutable
·published 2007-12-11 16:28 UTC
rendered paste body
/usr/bin/perl /usr/share/perl/5.8/ExtUtils/xsubpp  -typemap /usr/share/perl/5.8/ExtUtils/typemap -typemap typemap  IPTables.xs > IPTables.xsc && mv IPTables.xsc IPTables.c
/bin/pwd: couldn't find directory entry in `../../../../..' with matching i-node
Please specify prototyping behavior for IPTables.xs (see perlxs manual)
cc -c   -D_REENTRANT -D_GNU_SOURCE -DTHREADS_HAVE_PIDS -DDEBIAN -fno-strict-aliasing -pipe -I/usr/local/include -D_LARGEFILE_SOURCE -D_FILE_OFFSET_BITS=64 -O2   -DVERSION=\"0.05\" -DXS_VERSION=\"0.05\" -fPIC "-I/usr/lib/perl/5.8/CORE"   IPTables.c
IPTables.xs:616: error: static declaration of ‘parse_hostnetworkmask’ follows non-static declaration
/usr/include/iptables.h:163: error: previous declaration of ‘parse_hostnetworkmask’ was here
IPTables.xs:650: error: conflicting types for ‘find_match’
/usr/include/iptables.h:181: error: previous declaration of ‘find_match’ was here
IPTables.xs: In function ‘find_match’:
IPTables.xs:685: error: ‘struct iptables_match’ has no member named ‘used’
IPTables.xs: At top level:
IPTables.xs:704: error: static declaration of ‘parse_protocol’ follows non-static declaration
/usr/include/iptables.h:164: error: previous declaration of ‘parse_protocol’ was here
IPTables.xs:733: error: static declaration of ‘parse_interface’ follows non-static declaration
/usr/include/iptables.h:165: error: previous declaration of ‘parse_interface’ was here
IPTables.xs:820: error: static declaration of ‘addr_to_anyname’ follows non-static declaration
/usr/include/iptables.h:159: error: previous declaration of ‘addr_to_anyname’ was here
IPTables.xs:832: error: static declaration of ‘mask_to_dotted’ follows non-static declaration
/usr/include/iptables.h:160: error: previous declaration of ‘mask_to_dotted’ was here
IPTables.xs: In function ‘make_delete_mask’:
IPTables.xs:1343: error: ‘struct iptables_match’ has no member named ‘used’
IPTables.xs:1357: error: ‘struct iptables_match’ has no member named ‘used’
IPTables.xs: In function ‘generate_entry’:
IPTables.xs:1627: error: ‘struct iptables_match’ has no member named ‘used’
IPTables.xs:1640: error: ‘struct iptables_match’ has no member named ‘used’
IPTables.xs: In function ‘do_command’:
IPTables.xs:1685: error: ‘struct iptables_match’ has no member named ‘used’
IPTables.xs:2018: error: ‘struct iptables_match’ has no member named ‘used’
IPTables.xs:2064: error: ‘struct iptables_match’ has no member named ‘used’
IPTables.xs: In function ‘XS_IPTables__add_entry’:
IPTables.xs:2635: error: ‘struct iptables_match’ has no member named ‘used’
IPTables.xs:2723: error: ‘struct iptables_match’ has no member named ‘used’
IPTables.xs:2779: error: ‘struct iptables_match’ has no member named ‘used’
IPTables.xs: In function ‘XS_IPTables__Entry_clone’:
IPTables.xs:3100: error: ‘struct iptables_match’ has no member named ‘used’
make: *** [IPTables.o] Error 1
  /usr/bin/make  -- NOT OK
Running make test
  Can't test without successful make
Running make install
  make had returned bad status, install seems impossible