All pastes #810245 Raw Edit

Jemand

public text v1 · immutable
·published 2007-12-09 19:58 UTC
rendered paste body
creating w32/Makefile
sed: can't read ./w32/Makefile.in: No such file or directory
creating libelf.pc
creating config.h
creating lib/sys_elf.h
os.chdir('/home/waky/Downloads/urth-0.1-2-src/libs/ghf-0.8-0')
os.chdir('libs/libelf-0.8.9')
make install CFLAGS="-O2 -m32 " CXXFLAGS="-O2 -m32 " LDFLAGS="-s -m32 "
making install in lib
make[1]: Entering directory `/home/waky/Downloads/urth-0.1-2-src/libs/ghf-0.8-0/libs/libelf-0.8.9/lib'
if test -n ""; then \
          gcc -c -DHAVE_CONFIG_H -I.. -I. -I.  -O2 -m32    begin.c && mv -f begin.o begin.os; \
        else true; fi
gcc -c -DHAVE_CONFIG_H -I.. -I. -I.  -O2 -m32   begin.c
In file included from /usr/include/features.h:345,
                 from /usr/include/stdint.h:26,
                 from ./private.h:36,
                 from begin.c:20:
/usr/include/gnu/stubs.h:7:27: error: gnu/stubs-32.h: No such file or directory
make[1]: *** [begin.o] Error 1
make[1]: Leaving directory `/home/waky/Downloads/urth-0.1-2-src/libs/ghf-0.8-0/libs/libelf-0.8.9/lib'
make: *** [install-recursive] Error 1
scons: *** [/home/waky/Downloads/urth-0.1-2-src/libs/local/lib/libelf.a] Error 2
scons: building terminated because of errors.
scons: *** ['ghf-0.8-0/build/libghf.a'] Error 2
scons: building terminated because of errors.
waky@Pixelbox:~/Downloads/urth-0.1-2-src$ scons libs
scons: Reading SConscript files ...
scons: done reading SConscript files.
scons: Building targets ...
os.chdir('libs/ghf-0.8-0')
scons install i386=1 LIBS_PREFIX=/home/waky/Downloads/urth-0.1-2-src/libs/local
scons: Reading SConscript files ...
AttributeError: 'module' object has no attribute 'options':
  File "/home/waky/Downloads/urth-0.1-2-src/libs/ghf-0.8-0/SConstruct", line 53:
    env.SConscript(dirs='src', build_dir='build')
  File "/usr/lib/scons/SCons/Script/SConscript.py", line 520:
    return apply(_SConscript, [self.fs,] + files, subst_kw)
  File "/usr/lib/scons/SCons/Script/SConscript.py", line 245:
    exec _file_ in call_stack[-1].globals
  File "/home/waky/Downloads/urth-0.1-2-src/libs/ghf-0.8-0/build/SConscript", line 40:
    if (not 'libs' in COMMAND_LINE_TARGETS) and (not SCons.Script.Main.options.help_msg):
scons: *** [libs/local/lib/libghf.a] Error 2
scons: building terminated because of errors.
waky@Pixelbox:~/Downloads/urth-0.1-2-src$