rendered paste body[ 51%] Generating ui_pagerConfig.h
[ 52%] Generating plasma_applet_pager_automoc.cpp
Generating pager.moc
Scanning dependencies of target plasma_applet_pager
[ 52%] Building CXX object workspace/plasma/applets/pager/CMakeFiles/plasma_applet_pager.dir/plasma_applet_pager_automoc.o
[ 52%] Building CXX object workspace/plasma/applets/pager/CMakeFiles/plasma_applet_pager.dir/pager.o
[ 52%] Building CXX object workspace/plasma/applets/kickoff/CMakeFiles/plasma_applet_launcher.dir/core/systemmodel.o
/var/tmp/portage/kde-base/kdebase-9999.4/work/kdebase-9999.4/workspace/plasma/applets/kickoff/core/systemmodel.cpp:173: warning: unused parameter 'parent'
[ 52%] Building CXX object workspace/plasma/applets/kickoff/CMakeFiles/plasma_applet_launcher.dir/core/urlitemlauncher.o
/var/tmp/portage/kde-base/kdebase-9999.4/work/kdebase_build/workspace/plasma/applets/pager/ui_pagerConfig.h: In member function 'void Ui_pagerConfig::retranslateUi(QWidget*)':
/var/tmp/portage/kde-base/kdebase-9999.4/work/kdebase_build/workspace/plasma/applets/pager/ui_pagerConfig.h:75: error: 'class QWidget' has no member named 'setAccessibleName'
[ 52%] Building CXX object workspace/plasma/applets/kickoff/CMakeFiles/plasma_applet_simplelauncher.dir/ui/flipscrollview.o
/var/tmp/portage/kde-base/kdebase-9999.4/work/kdebase-9999.4/workspace/plasma/applets/kickoff/core/urlitemlauncher.cpp:129: warning: unused parameter 'errorData'
make[2]: *** [workspace/plasma/applets/pager/CMakeFiles/plasma_applet_pager.dir/pager.o] Error 1
make[1]: *** [workspace/plasma/applets/pager/CMakeFiles/plasma_applet_pager.dir/all] Error 2
make[1]: *** Waiting for unfinished jobs....
[ 52%] Building CXX object workspace/plasma/applets/kickoff/CMakeFiles/plasma_applet_launcher.dir/core/itemhandlers.o
[ 52%] Building CXX object workspace/plasma/applets/kickoff/CMakeFiles/plasma_applet_launcher.dir/ui/itemdelegate.o
/var/tmp/portage/kde-base/kdebase-9999.4/work/kdebase-9999.4/workspace/plasma/applets/kickoff/ui/itemdelegate.cpp: In member function 'virtual void Kickoff::ItemDelegate::paint(QPainter*, const QStyleOptionViewItem&, const QModelIndex&) const':
/var/tmp/portage/kde-base/kdebase-9999.4/work/kdebase-9999.4/workspace/plasma/applets/kickoff/ui/itemdelegate.cpp:95: warning: passing 'qreal' for argument 3 to 'void QRect::adjust(int, int, int, int)'
[ 52%] Building CXX object workspace/plasma/applets/kickoff/CMakeFiles/plasma_applet_launcher.dir/ui/contextmenufactory.o
[ 52%] Building CXX object workspace/plasma/applets/kickoff/CMakeFiles/plasma_applet_launcher.dir/ui/flipscrollview.o
[ 52%] Building CXX object workspace/plasma/applets/kickoff/CMakeFiles/plasma_applet_simplelauncher.dir/ui/launcher.o
[ 52%] Building CXX object workspace/plasma/applets/kickoff/CMakeFiles/plasma_applet_launcher.dir/ui/launcher.o
[ 52%] Building CXX object workspace/plasma/applets/kickoff/CMakeFiles/plasma_applet_launcher.dir/ui/searchbar.o
[ 52%] Building CXX object workspace/plasma/applets/kickoff/CMakeFiles/plasma_applet_launcher.dir/ui/tabbar.o
/var/tmp/portage/kde-base/kdebase-9999.4/work/kdebase-9999.4/workspace/plasma/applets/kickoff/ui/tabbar.cpp: In member function 'virtual void Kickoff::TabBar::paintEvent(QPaintEvent*)':
/var/tmp/portage/kde-base/kdebase-9999.4/work/kdebase-9999.4/workspace/plasma/applets/kickoff/ui/tabbar.cpp:89: warning: passing 'qreal' for argument 1 to 'void QColor::setAlpha(int)'
/var/tmp/portage/kde-base/kdebase-9999.4/work/kdebase-9999.4/workspace/plasma/applets/kickoff/ui/tabbar.cpp:98: warning: converting to 'int' from 'qreal'
[ 52%] Building CXX object workspace/plasma/applets/kickoff/CMakeFiles/plasma_applet_simplelauncher.dir/ui/searchbar.o
[ 52%] Building CXX object workspace/plasma/applets/kickoff/CMakeFiles/plasma_applet_launcher.dir/ui/urlitemview.o
[ 52%] Building CXX object workspace/plasma/applets/kickoff/CMakeFiles/plasma_applet_launcher.dir/screensaver_interface.o
[ 52%] Building CXX object workspace/plasma/applets/kickoff/CMakeFiles/plasma_applet_launcher.dir/krunner_interface.o
[ 52%] Building CXX object workspace/plasma/applets/kickoff/CMakeFiles/plasma_applet_simplelauncher.dir/ui/tabbar.o
[ 52%] Building CXX object workspace/plasma/applets/kickoff/CMakeFiles/plasma_applet_launcher.dir/applet/applet.o
[ 52%] Building CXX object workspace/plasma/applets/kickoff/CMakeFiles/plasma_applet_simplelauncher.dir/ui/urlitemview.o
/var/tmp/portage/kde-base/kdebase-9999.4/work/kdebase-9999.4/workspace/plasma/applets/kickoff/ui/tabbar.cpp: In member function 'virtual void Kickoff::TabBar::paintEvent(QPaintEvent*)':
/var/tmp/portage/kde-base/kdebase-9999.4/work/kdebase-9999.4/workspace/plasma/applets/kickoff/ui/tabbar.cpp:89: warning: passing 'qreal' for argument 1 to 'void QColor::setAlpha(int)'
/var/tmp/portage/kde-base/kdebase-9999.4/work/kdebase-9999.4/workspace/plasma/applets/kickoff/ui/tabbar.cpp:98: warning: converting to 'int' from 'qreal'
[ 52%] Building CXX object workspace/plasma/applets/kickoff/CMakeFiles/plasma_applet_simplelauncher.dir/screensaver_interface.o
Linking CXX shared module ../../../../lib/plasma_applet_launcher.so
[ 52%] Building CXX object workspace/plasma/applets/kickoff/CMakeFiles/plasma_applet_simplelauncher.dir/krunner_interface.o
[ 52%] Building CXX object workspace/plasma/applets/kickoff/CMakeFiles/plasma_applet_simplelauncher.dir/simpleapplet/menuview.o
[ 52%] Built target plasma_applet_launcher
[ 52%] Building CXX object workspace/plasma/applets/kickoff/CMakeFiles/plasma_applet_simplelauncher.dir/simpleapplet/simpleapplet.o
Linking CXX shared module ../../../../lib/plasma_applet_simplelauncher.so
[ 52%] Built target plasma_applet_simplelauncher
make: *** [all] Error 2