All pastes #80965 Raw Edit

Someone

public text v1 · immutable
·published 2006-07-06 23:58 UTC
rendered paste body
 gcc -DHAVE_CONFIG_H -I. -I. -I.. -I.. -I./.. -I../intl -DCAMEL_LIBEXECDIR=\"/op t/gnome2/libexec\" -DCAMEL_PROVIDERDIR=\"/opt/gnome2/lib/evolution-data-server-1 .2/camel-providers\" -DG_LOG_DOMAIN=\"camel\" -DCAMEL_EXPLICIT_TRANSLATION_DOMAI N=\"evolution-data-server-1.8\" -DE_DATA_SERVER_PREFIX=\"/opt/gnome2\" -DEVOLUTI ON_LOCALEDIR=\"/opt/gnome2/share/locale\" -pthread -DORBIT2=1 -I/opt/gnome/inclu de/glib-2.0 -I/opt/gnome/lib/glib-2.0/include -I/opt/gnome/include/gnome-vfs-2.0  -I/opt/gnome/lib/gnome-vfs-2.0/include -I/opt/gnome/include/bonobo-activation-2 .0 -I/opt/gnome/include/libbonobo-2.0 -I/opt/gnome/include/gconf/2 -I/opt/gnome/ include/orbit-2.0 -I/usr/include/nspr4 -I/usr/include/nss3 -D_LARGEFILE64_SOURCE  -g -O2 -Wall -Wmissing-prototypes -Wno-sign-compare -MT camel-string-utils.lo - MD -MP -MF .deps/camel-string-utils.Tpo -c camel-string-utils.c  -fPIC -DPIC -o .libs/camel-string-utils.o
camel-string-utils.c: In function 'camel_pstring_add':
camel-string-utils.c:167: error: 's' undeclared (first use in this function)
camel-string-utils.c:167: error: (Each undeclared identifier is reported only on ce
camel-string-utils.c:167: error: for each function it appears in.)
camel-string-utils.c:180: warning: dereferencing type-punned pointer will break strict-aliasing rules
camel-string-utils.c: In function 'camel_pstring_free':
camel-string-utils.c:236: warning: dereferencing type-punned pointer will break strict-aliasing rules
make[3]: *** [camel-string-utils.lo] Error 1
make[3]: Leaving directory `/home/atul/cvs/gnome2/evolution-data-server/camel'
make[2]: *** [all-recursive] Error 1
make[2]: Leaving directory `/home/atul/cvs/gnome2/evolution-data-server/camel'
make[1]: *** [all-recursive] Error 1
make[1]: Leaving directory `/home/atul/cvs/gnome2/evolution-data-server'
make: *** [all] Error 2
*** error during stage build of evolution-data-server: Error running make   *** [2/3]


  [1] rerun stage build
  [2] ignore error and continue to install
  [3] give up on module
  [4] start shell
  [5] go to stage force_checkout
  [6] go to stage configure
choice: invalid choice

  [1] rerun stage build
  [2] ignore error and continue to install
  [3] give up on module
  [4] start shell
  [5] go to stage force_checkout
  [6] go to stage configure
choice: Interrupted