All pastes #809139 Raw Edit

Installation of autogen version

public text v1 · immutable
·published 2007-12-08 08:15 UTC
rendered paste body
qvantel@qvantel-desktop:~/Desktop/autogen-5.9.4pre11$ make

make  all-recursive
make[1]: Entering directory `/home/qvantel/Desktop/autogen-5.9.4pre11'
Making all in compat
make[2]: Entering directory `/home/qvantel/Desktop/autogen-5.9.4pre11/compat'
:
make[2]: Leaving directory `/home/qvantel/Desktop/autogen-5.9.4pre11/compat'
Making all in snprintfv
make[2]: Entering directory `/home/qvantel/Desktop/autogen-5.9.4pre11/snprintfv'
make[2]: Nothing to be done for `all'.
make[2]: Leaving directory `/home/qvantel/Desktop/autogen-5.9.4pre11/snprintfv'
Making all in autoopts
make[2]: Entering directory `/home/qvantel/Desktop/autogen-5.9.4pre11/autoopts'
Making all in test
make[3]: Entering directory `/home/qvantel/Desktop/autogen-5.9.4pre11/autoopts/test'
make[3]: Nothing to be done for `all'.
make[3]: Leaving directory `/home/qvantel/Desktop/autogen-5.9.4pre11/autoopts/test'
make[3]: Entering directory `/home/qvantel/Desktop/autogen-5.9.4pre11/autoopts'
/bin/bash mk-autoopts-pc autoopts.pc
make[3]: Leaving directory `/home/qvantel/Desktop/autogen-5.9.4pre11/autoopts'
make[2]: Leaving directory `/home/qvantel/Desktop/autogen-5.9.4pre11/autoopts'
Making all in agen5
make[2]: Entering directory `/home/qvantel/Desktop/autogen-5.9.4pre11/agen5'
Making all in test
make[3]: Entering directory `/home/qvantel/Desktop/autogen-5.9.4pre11/agen5/test'
make[3]: Nothing to be done for `all'.
make[3]: Leaving directory `/home/qvantel/Desktop/autogen-5.9.4pre11/agen5/test'
make[3]: Entering directory `/home/qvantel/Desktop/autogen-5.9.4pre11/agen5'
( echo '#define DEFINING' ; echo '#include "autogen.h"' ; \
        for f in autogen.c   agCgi.c     agInit.c       agShell.c  cgi-fsm.c defDirect.c agUtils.c   defParse-fsm.c defLex.c   defLoad.c defFind.c   expFormat.c expGperf.c     expGuile.c expExtract.c expOutput.c expPrint.c  expState.c     expMake.c  fmemopen.c funcCase.c  funcDef.c   expString.c    funcFor.c  funcIf.c functions.c funcEval.c  loadPseudo.c   opts.c     scmStrings.c tpLoad.c    tpProcess.c tpParse.c ; do echo "#include \"$f\"" ; done ) > ag.c
gcc -std=gnu99 -DHAVE_CONFIG_H -I. -I.. -I.. -I../autoopts    -g -O2 -Wall -Werror -Wcast-align -Wmissing-prototypes -Wpointer-arith -Wshadow -Wstrict-prototypes -Wwrite-strings -fno-strict-aliasing -MT autogen-ag.o -MD -MP -MF .deps/autogen-ag.Tpo -c -o autogen-ag.o `test -f 'ag.c' || echo './'`ag.c
mv -f .deps/autogen-ag.Tpo .deps/autogen-ag.Po
/bin/bash ../libtool --tag=CC   --mode=link gcc -std=gnu99  -g -O2 -Wall -Werror -Wcast-align -Wmissing-prototypes -Wpointer-arith -Wshadow -Wstrict-prototypes -Wwrite-strings -fno-strict-aliasing -export-dynamic  -o autogen  autogen-ag.o ../autoopts/libopts.la ../snprintfv/libsnprintfv.la -lguile -lltdl  -lgmp -lcrypt -lm -lltdl -lm -ldl 
gcc -std=gnu99 -g -O2 -Wall -Werror -Wcast-align -Wmissing-prototypes -Wpointer-arith -Wshadow -Wstrict-prototypes -Wwrite-strings -fno-strict-aliasing -o .libs/autogen autogen-ag.o -Wl,--export-dynamic  ../autoopts/.libs/libopts.so ../snprintfv/.libs/libsnprintfv.a /usr/lib/libguile.so /usr/lib/libgmp.so -lcrypt /usr/lib/libltdl.so -lm -ldl 
creating autogen
+ for t in '"$@"'
+ echo Re-building stamp-man
Re-building stamp-man
+ case "$t" in
+ test -z /home/qvantel/Desktop/autogen-5.9.4pre11/agen5/autogen -o -z /home/qvantel/Desktop/autogen-5.9.4pre11/columns/columns
+ eopt='-L /home/qvantel/Desktop/autogen-5.9.4pre11/autoopts -Tagman1 -bautogen'
+ echo /home/qvantel/Desktop/autogen-5.9.4pre11/agen5/autogen -L /home/qvantel/Desktop/autogen-5.9.4pre11/autoopts -Tagman1 -bautogen ./opts.def
/home/qvantel/Desktop/autogen-5.9.4pre11/agen5/autogen -L /home/qvantel/Desktop/autogen-5.9.4pre11/autoopts -Tagman1 -bautogen ./opts.def
+ /home/qvantel/Desktop/autogen-5.9.4pre11/agen5/autogen -L /home/qvantel/Desktop/autogen-5.9.4pre11/autoopts -Tagman1 -bautogen ./opts.def
AutoGen aborting on signal 11 (Segmentation fault) in state DONE
processing template (if (> (string-length shell-cleanup) 0) (shell shell-cleanup) )
            on line 592
       for function Text (18)
./bootstrap.dir: line 145:   629 Aborted                 (core dumped) ${AGexe} ${eopt} ${srcdir}/opts.def
make[3]: *** [stamp-man] Error 134
make[3]: Leaving directory `/home/qvantel/Desktop/autogen-5.9.4pre11/agen5'
make[2]: *** [all-recursive] Error 1
make[2]: Leaving directory `/home/qvantel/Desktop/autogen-5.9.4pre11/agen5'
make[1]: *** [all-recursive] Error 1
make[1]: Leaving directory `/home/qvantel/Desktop/autogen-5.9.4pre11'
make: *** [all] Error 2
qvantel@qvantel-desktop:~/Desktop/autogen-5.9.4pre11$ make
make  all-recursive
make[1]: Entering directory `/home/qvantel/Desktop/autogen-5.9.4pre11'
Making all in compat
make[2]: Entering directory `/home/qvantel/Desktop/autogen-5.9.4pre11/compat'
:
make[2]: Leaving directory `/home/qvantel/Desktop/autogen-5.9.4pre11/compat'
Making all in snprintfv
make[2]: Entering directory `/home/qvantel/Desktop/autogen-5.9.4pre11/snprintfv'
make[2]: Nothing to be done for `all'.
make[2]: Leaving directory `/home/qvantel/Desktop/autogen-5.9.4pre11/snprintfv'
Making all in autoopts
make[2]: Entering directory `/home/qvantel/Desktop/autogen-5.9.4pre11/autoopts'
Making all in test
make[3]: Entering directory `/home/qvantel/Desktop/autogen-5.9.4pre11/autoopts/test'
make[3]: Nothing to be done for `all'.
make[3]: Leaving directory `/home/qvantel/Desktop/autogen-5.9.4pre11/autoopts/test'
make[3]: Entering directory `/home/qvantel/Desktop/autogen-5.9.4pre11/autoopts'
make[3]: Nothing to be done for `all-am'.
make[3]: Leaving directory `/home/qvantel/Desktop/autogen-5.9.4pre11/autoopts'
make[2]: Leaving directory `/home/qvantel/Desktop/autogen-5.9.4pre11/autoopts'
Making all in agen5
make[2]: Entering directory `/home/qvantel/Desktop/autogen-5.9.4pre11/agen5'
Making all in test
make[3]: Entering directory `/home/qvantel/Desktop/autogen-5.9.4pre11/agen5/test'
make[3]: Nothing to be done for `all'.
make[3]: Leaving directory `/home/qvantel/Desktop/autogen-5.9.4pre11/agen5/test'
make[3]: Entering directory `/home/qvantel/Desktop/autogen-5.9.4pre11/agen5'
+ for t in '"$@"'
+ echo Re-building stamp-man
Re-building stamp-man
+ case "$t" in
+ test -z /home/qvantel/Desktop/autogen-5.9.4pre11/agen5/autogen -o -z /home/qvantel/Desktop/autogen-5.9.4pre11/columns/columns
+ eopt='-L /home/qvantel/Desktop/autogen-5.9.4pre11/autoopts -Tagman1 -bautogen'
+ echo /home/qvantel/Desktop/autogen-5.9.4pre11/agen5/autogen -L /home/qvantel/Desktop/autogen-5.9.4pre11/autoopts -Tagman1 -bautogen ./opts.def
/home/qvantel/Desktop/autogen-5.9.4pre11/agen5/autogen -L /home/qvantel/Desktop/autogen-5.9.4pre11/autoopts -Tagman1 -bautogen ./opts.def
+ /home/qvantel/Desktop/autogen-5.9.4pre11/agen5/autogen -L /home/qvantel/Desktop/autogen-5.9.4pre11/autoopts -Tagman1 -bautogen ./opts.def
AutoGen aborting on signal 11 (Segmentation fault) in state DONE
processing template (if (> (string-length shell-cleanup) 0) (shell shell-cleanup) )
            on line 592
       for function Text (18)
./bootstrap.dir: line 145: 18196 Aborted                 (core dumped) ${AGexe} ${eopt} ${srcdir}/opts.def
make[3]: *** [stamp-man] Error 134
make[3]: Leaving directory `/home/qvantel/Desktop/autogen-5.9.4pre11/agen5'
make[2]: *** [all-recursive] Error 1
make[2]: Leaving directory `/home/qvantel/Desktop/autogen-5.9.4pre11/agen5'
make[1]: *** [all-recursive] Error 1
make[1]: Leaving directory `/home/qvantel/Desktop/autogen-5.9.4pre11'
make: *** [all] Error 2