All pastes #808523 Raw Edit

transmission build error

public text v1 · immutable
·published 2007-12-07 18:03 UTC
rendered paste body

Configuration:

        Source code location:    .
        Compiler:                g++
        Build libtransmission:   yes
        Build Daemon:            yes
        Build BeOS client:       no
        Build GTK+ client:       no
        Build OS X client:       no
        Build wxWidgets client:  no
**********************************************************

In file included from platform.c:45:
/usr/include/pthread.h:441: error: expected â)â before â*â token
/usr/include/pthread.h:446: error: expected â)â before â*â token
/usr/include/pthread.h:449: error: expected â)â before â*â token
/usr/include/pthread.h:452: error: expected â)â before â*â token
/usr/include/pthread.h:462: error: expected â)â before â*â token
/usr/include/pthread.h:465: error: expected â)â before â*â token
/usr/include/pthread.h:475: error: expected â)â before â*â token
/usr/include/pthread.h:481: error: expected â)â before â*â token
/usr/include/pthread.h:484: error: expected â)â before â*â token
/usr/include/pthread.h:487: error: expected â;â, â,â or â)â before â*â token
/usr/include/pthread.h:492: error: expected â)â before â*â token
/usr/include/pthread.h:496: error: expected â;â, â,â or â)â before â*â token
/usr/include/pthread.h:500: error: expected â)â before â*â token
make[2]: *** [platform.o] Error 1
make[2]: Leaving directory `/home/root/transmission-0.95/libtransmission'
make[1]: *** [all] Error 2
make[1]: Leaving directory `/home/root/transmission-0.95/libtransmission'
make: *** [all-recursive] Error 1